{"text_format":"1","workbook":"xlsx","n_sheets":15,"sheets":["Settings & Support","Start","Income","Outgoings - Fixed","Outgoings - Flexible","Savings","Debt Admin Fee","Debts","Notes(2)","Notes","SFS v2.0","Detailed Statement v2.0","Conversions","Spending Guidelines","Lookup"],"not_rendered":{"charts":0,"images":13,"macros":1,"external_links":0,"defined_names":6,"comments":0,"pivot_tables":0},"unopened":[],"bounds":{"document_bytes":16777216,"sheet_cells":100000,"rows_first":2000,"rows_last":500,"rows_between":2000,"halvings":0,"cell_chars":16384,"cell_head_chars":4096},"cells_cut":0,"cells_raw":0,"read":"whole","date_system":"1900"}

{"sheet":"Settings & Support","index":0,"n_rows":183,"n_cols":2,"rows_kept":183,"cut":false,"hidden":false,"merged":[[31,0,31,10],[33,0,33,10],[55,1,55,9],[142,1,142,9],[168,1,168,9],[48,1,48,9],[51,1,51,9]]}
[]
[]
[]
[]
[]
[]
[]
[]
[]
[]
[]
[]
[]
[]
[]
[]
[]
[]
[]
[]
[]
[]
[]
[]
[]
[]
[]
[]
[]
[]
[]
["SFS Excel Template "]
[]
["Technical Guidance"]
[]
[]
[]
[]
[]
[]
[]
[]
[]
[]
[]
[]
[]
[null,"Introduction"]
[null,"The SFS excel template document is dynamic income and expenditure spreadsheet designed to output an SFS report as a PDF document from a person’s Income, Expenditure & Debts."]
[]
[]
[null,"However there are a number of convenience features which require MACROs to be enabled - these are small programs written in Visual Basic incorporated into the spreadsheet, and they have to be ENABLED to run properly. "]
[]
[]
[null,"Step 1:- "]
[null,"To enable Macros, first click on Tools on the menu bar in Excel, down to Macro, then across and click on Security."]
[]
[]
[]
[]
[]
[]
[]
[]
[]
[]
[]
[]
[]
[]
[]
[]
[]
[]
[]
[]
[null,"For later versions of Excel (2007 and later)"]
[]
[null,"1.   Click the Microsoft Office Button           , and then click Excel Options."]
[null,"2.   Click Trust Center, click Trust Center Settings, and then click Macro Settings."]
[null,"3.   Enable all macros. Click this option to allow all macros to run"]
[]
[]
[]
[]
[]
[]
[]
[]
[]
[null,"In the Security window, set the Security Level to Medium,  "]
[]
[]
[]
[]
[]
[]
[]
[]
[]
[]
[]
[]
[]
[]
[]
[]
[]
[]
[]
[]
[]
[]
[]
[]
[null,"Step 2:-"]
[null,"Now close Excel (print these instructions if necessary), then re-open SFS, and click"]
[null,"on the Enable Macros button."]
[]
[]
[]
[]
[]
[]
[]
[]
[]
[]
[]
[]
[]
[]
[]
[]
[]
[]
[]
[]
[]
[]
[]
[null,"Step 3:-"]
[null,"If the Security Warning window pops up, displaying a warning that CFS contains macros, click on the Always trust macros from this source checkbox and click Enable Macros. "]
[]
[]
[]
[]
[]
[]
[]
[]
[]
[]
[]
[]
[]
[]
[]
[]
[]
[]
[null,"SFS should then be fully functional."]
[]
[]
[null,"Compatibility"]
[null,"Windows"]
[null,"Office 2000, 2003, 2007, 2010, 2013 & 2016"]
[null,"OSX"]
[null,"(not compatible due to missing components in the Mac versions of Office) Please use a virtual machine running Windows to use the SFS template on a MAC."]
[]
[]
[null,"Bugs and glitches"]
[null,"If you come across any bugs, glitches or difficulties "]
[null,"with this version of the SFS spreadsheet, please"]
[null,"email us at sfs.support@moneyadviceservice.org.uk about them so we can fix them and"]
[null,"improve the product."]
[]
[null,"Please include (if known):-"]
[null,"  - Version of Office (Office 2000, XP, 2003, 2007 etc.)"]
[null,"  - Operating system (Windows XP, Vista etc.)"]
[]
[null,"For a specific 'bug' if possible please send the SFS as a file attachment"]
[null,"(please remove any personal details etc.)"]

{"sheet":"Start","index":1,"n_rows":35,"n_cols":16,"rows_kept":35,"cut":false,"hidden":false,"merged":[[17,2,17,5],[19,8,19,15],[21,8,21,15],[14,8,14,15],[17,8,17,15],[15,8,15,15],[23,8,23,15],[19,2,19,5],[20,2,20,5],[18,2,18,5],[27,1,27,5],[25,1,25,5],[23,1,23,5],[21,1,21,5],[29,8,30,8],[29,10,30,10],[26,2,26,5],[28,2,28,5],[24,2,24,5],[5,1,5,15],[8,2,8,5],[10,2,10,5],[14,2,14,5],[16,2,16,5],[8,8,8,15],[10,8,10,15],[12,8,12,15],[6,7,6,15],[9,7,9,15],[11,7,11,15],[9,1,9,5],[11,1,11,5],[13,8,13,15],[15,1,15,5]]}
[]
[]
[]
[]
[]
[null,"Please complete the fields below, then click on the Monthly Income tab at the bottom of the screen to continue inputting data. For keying in data or (especially) pasting from another application, it's best to first DOUBLE-CLICK the data input field. "]
[]
[]
[null,"Name:",null,null,null,null,null,"Contact/Team name:"]
[]
[null,"Date of Birth:",null,null,null,null,null,"Agency:"]
[]
[null,"Application:","Single:",false,"Joint:",false]
[null,null,null,null,null,null,null,"Agency address:"]
[null,"Partner: (if applicable):"]
[]
[null,"Partner D.O.B. (if applicable):"]
[null,null,null,null,null,null,null,"Membership code number:",12884569]
[null,"Address:"]
[null,null,null,null,null,null,null,"Case reference number:"]
[]
[null," ",null,null,null,null,null,"Date of statement:"]
[{"$f":"D23+F23+C25+1","v":1},"Dependent children: ","Under 16:",null,"16-18:"]
[null,null,null,null,null,null,null,"Date of review (if applicable):"]
[null,"Other dependants: "]
[null,null,null,null,null,null,null,"Employment: ","Client",null,"Partner",null,null,"Client",null,"Partner"]
[null,"Number in household:",null,null,null,null,null,"Full time: ",false,null,false,null,"Self employed:",false,null,false]
[null,null,null,null,null,null,null,"Part time: ",false,null,false,null,"Retired:",false,null,false]
[null,"Number of vehicles in household:",null,null,null,null,null,"Unemployed: ",false,null,false,null,"Carer:",false,null,false]
[null,null,null,null,null,null,null,"Not working due to ",false,null,false,null,"Student:",false,null,false]
[null,"Housing tenure:",null,null,null,null,null,"illness / disability:",null,null,null,null,"Other:",false,null,false]
[null,"Owner",false,null,"Tenant - private",false]
[null,"Mortgage",false,null,"Tenant - Social",false,null,"Please confirm you have considered ",null,null,null,null,null,null,null,"Tick to confirm ✔"]
[null,"Living with parents",false,null,"Other",false,null,"(or discussed with an adviser) the use of ",null,null,null,null,null,false]
[null,null,null,null,null,null,null,"any assets to make lump sum payments"]

{"sheet":"Income","index":2,"n_rows":55,"n_cols":10,"rows_kept":55,"cut":false,"hidden":false,"merged":[]}
[null,"Monthly Income"]
[]
[null,"Earnings ",null,"Amount (£) ",null,"Frequency",null,"Include Notes in statement",null,"Notes"]
[1,"Salary or wages (take home)",null,null,null,"M",null,false]
[2,"Partner salary or wages (take home)",null,null,null,"M",null,false]
[3,"Other earnings (including self employment)",null,null,null,"M",null,false]
[null,"Total salary and wages per month",null,{"$f":"Conversions!H14","v":0}]
[]
[null,"Benefits and tax credits"]
[4,"Universal Credit",null,null,null,"M",null,false]
[5,"Jobseeker’s Allowance (income based)",null,null,null,"M",null,false]
[6,"Jobseeker’s Allowance (contribution based)",null,null,null,"M",null,false]
[7,"Income Support",null,null,null,"M",null,false]
[8,"Working Tax Credit",null,null,null,"M",null,false]
[9,"Child Tax Credit",null,null,null,"M",null,false]
[10,"Child Benefit",null,null,null,"M",null,false]
[11,"Employment and Support Allowance or Statutory Sick Pay",null,null,null,"M",null,false]
[12,"Disability benefits",null,null,null,"M",null,false]
[13,"Carer’s Allowance",null,null,null,"M",null,false]
[14,"Local Housing Allowance / Housing Benefit",null,null,null,"M",null,false]
[15,"Council Tax support",null,null,null,"M",null,false]
[16,"Other benefits/tax credits (e.g. maternity benefits)",null,null,null,"M",null,false]
[null,"Total benefits and tax credits per month",null,{"$f":"Conversions!H30","v":0}]
[]
[null,"Pensions"]
[17,"State pensions",null,null,null,"M",null,false]
[18,"Private or work pensions",null,null,null,"M",null,false]
[19,"Pension credit",null,null,null,"M",null,false]
[20,"Other pensions",null,null,null,"M",null,false]
[null,"Total pensions per month",null,{"$f":"Conversions!H38","v":0}]
[]
[null,"Other income "]
[21,"Maintenance or child support",null,null,null,"M",null,false]
[22,"Boarders or lodgers",null,null,null,"M",null,false]
[23,"Non-dependants’ contributions",null,null,null,"M",null,false]
[24,"Student loans and grants",null,null,null,"M",null,false]
[25,"Other income",null,null,null,"M",null,false]
[null,"Total other income per month",null,{"$f":"Conversions!H47","v":0}]
[]
[null,"Monthly total income",null,{"$f":"Conversions!H48","v":0}]
[]
[null,"Assets or Equity"]
[null,"House or Flat"]
[null,"Total value of property(ies)"]
[null,"Mortgage outstanding"]
[null,"Secured loan(s) outstanding"]
[null,"Total Equity",null,{"$f":"D44 - D45 - D46","v":0}]
[]
[null,"Other assets"]
[null,"Value of vehicle(s) (less HP outstanding)"]
[null,"Savings"]
[null,"Other assets"]
[null,"Total Other Assets",null,{"$f":"SUM(D50:D52)","v":0}]
[]
[null,"Total Assets and Equity",null,{"$f":"D47+D53","v":0}]

{"sheet":"Outgoings - Fixed","index":3,"n_rows":76,"n_cols":10,"rows_kept":76,"cut":false,"hidden":false,"merged":[]}
[null,"Monthly Outgoings: Fixed costs "]
[]
[null,"Home and contents ",null,"Amount (£) ",null,"Frequency",null,"Include Notes in statement",null,"Notes"]
[26,"Rent",null,null,null,"M",null,false]
[27,"Ground rent & service charges  \n(factor fees if you live in Scotland)",null,null,null,"M",null,false]
[28,"Mortgage",null,null,null,"M",null,false]
[29,"Mortgage endowment",null,null,null,"M",null,false]
[30,"Secured loans",null,null,null,"M",null,false]
[31,"Council tax/rates (including water charge if you \nlive in Scotland and rates in NI)",null,null,null,"M",null,false]
[32,"Appliance & furniture rental (including appliance \nand furniture HP, conditional sale and so on)",null,null,null,"M",null,false]
[33,"TV licence",null,null,null,"M",null,false]
[34,"Other costs",null,null,null,"M",null,false]
[null,"Total home & contents costs per month",null,{"$f":"Conversions!H61","v":0}]
[]
[null,"Utilities "]
[35,"Gas",null,null,null,"M",null,false]
[36,"Electricity",null,null,null,"M",null,false]
[37,"Other costs (including coal, oil, calor gas etc.)",null,null,null,"M",null,false]
[38,"Other expenditure",null,null,null,"M",null,false]
[null,"Total utilities costs per month",null,{"$f":"Conversions!H69","v":0}]
[]
[null,"Water "]
[39,"Water supply",null,null,null,"M",null,false]
[40,"Water waste",null,null,null,"M",null,false]
[null,"Total water costs per month",null,{"$f":"Conversions!H75","v":0}]
[]
[null,"Care and health costs "]
[41,"Childcare costs",null,null,null,"M",null,false]
[42,"Adult-care costs",null,null,null,"M",null,false]
[43,"Child maintenance or child support",null,null,null,"M",null,false]
[44,"Prescriptions and medicines",null,null,null,"M",null,false]
[45,"Dentistry and opticians",null,null,null,"M",null,false]
[46,"Other costs",null,null,null,"M",null,false]
[null,"Total care and health costs per month",null,{"$f":"Conversions!H85","v":0}]
[]
[null,"Transport and travel"]
[47,"Public transport (e.g. work, school, shopping)",null,null,null,"M",null,false]
[48,"Hire Purchase or conditional sale vehicle",null,null,null,"M",null,false]
[49,"Car insurance",null,null,null,"M",null,false]
[50,"Road tax",null,null,null,"M",null,false]
[51,"MOT and ongoing maintenance",null,null,null,"M",null,false]
[52,"Breakdown cover",null,null,null,"M",null,false]
[53,"Fuel, parking and toll road charges",null,null,null,"M",null,false]
[54,"Other costs (including taxis)",null,null,null,"M",null,false]
[null,"Total transport and travel costs per month",null,{"$f":"Conversions!H97","v":0}]
[]
[null,"School costs"]
[55,"School uniform",null,null,null,"M",null,false]
[56,"After-school clubs and school trips",null,null,null,"M",null,false]
[57,"Other costs",null,null,null,"M",null,false]
[null,"Total school costs per month",null,{"$f":"Conversions!H104","v":0}]
[]
[null,"Pensions and insurances "]
[58,"Pension payments",null,null,null,"M",null,false]
[59,"Life insurance",null,null,null,"M",null,false]
[60,"Mortgage payment protection insurance",null,null,null,"M",null,false]
[61,"Buildings and contents insurance",null,null,null,"M",null,false]
[62,"Health insurance (medical or accident or dental)",null,null,null,"M",null,false]
[63,"Other costs",null,null,null,"M",null,false]
[null,"Total pensions and insurance costs per month",null,{"$f":"Conversions!H113","v":0}]
[]
[null,"Professional costs"]
[64,"Professional courses",null,null,null,"M",null,false]
[65,"Union fees",null,null,null,"M",null,false]
[66,"Professional fees",null,null,null,"M",null,false]
[67,"Other",null,null,null,"M",null,false]
[null,"Total professional costs per month",null,{"$f":"Conversions!H120","v":0}]
[]
[null,"Other essential costs"]
[68,null,null,null,null,"M",null,false]
[69,null,null,null,null,"M",null,false]
[70,null,null,null,null,"M",null,false]
[71,null,null,null,null,"M",null,false]
[null,"Total other essential costs per month",null,{"$f":"Conversions!H128","v":0}]
[]
[null,"Monthly total fixed cost outgoings",null,{"$f":"Conversions!H129","v":0}]

{"sheet":"Outgoings - Flexible","index":4,"n_rows":36,"n_cols":10,"rows_kept":36,"cut":false,"hidden":false,"merged":[[33,7,33,10],[29,7,31,9]]}
[null,"Monthly Outgoings: Flexible costs",null,null,null,null,null,true,null,"       Show Spending Guidelines"]
[]
[null,"Communications and leisure",null,"Amount (£) ",null,"Frequency",null,"Include Notes in statement",null,"Notes"]
[72,"Home phone, internet, TV package  \n(including film subscriptions)",null,null,null,"M",null,false]
[73,"Mobile phone ",null,null,null,"M",null,false]
[74,"Hobbies, leisure or sport  \n(e.g. socialising, eating out, outings, clubs, leisure courses)",null,null,null,"M",null,false]
[75,"Gifts (e.g. birthdays, festivals, charity donations)",null,null,null,"M",null,false]
[76,"Pocket money",null,null,null,"M",null,false]
[77,"Newspapers, magazines, stationery and postage",null,null,null,"M",null,false]
[78,"Other costs",null,null,null,"M",null,false]
[null,"Total communications and leisure costs per month",null,{"$f":"Conversions!H141","v":0},null,{"$f":"IF($H$1=TRUE,'Spending Guidelines'!P12,\"\")","v":65}]
[]
[null,"Food and housekeeping "]
[79,"Groceries (e.g. food, pet food,  \nnon-alcoholic drinks, cleaning)",null,null,null,"M",null,false]
[80,"Nappies and baby items",null,null,null,"M",null,false]
[81,"School meals and meals at work",null,null,null,"M",null,false]
[82,"Laundry and dry cleaning",null,null,null,"M",null,false]
[83,"Alcohol",null,null,null,"M",null,false]
[84,"Smoking products",null,null,null,"M",null,false]
[85,"Vet bills & pet insurance",null,null,null,"M",null,false]
[86,"House repairs and maintenance",null,null,null,"M",null,false]
[87,"Other costs",null,null,null,"M",null,false]
[null,"Total food and housekeeping costs per month",null,{"$f":"Conversions!H154","v":0},null,{"$f":"IF($H$1=TRUE,'Spending Guidelines'!P13,\"\")","v":109}]
[]
[null,"Personal costs "]
[88,"Clothing and footwear",null,null,null,"M",null,false]
[89,"Hairdressing",null,null,null,"M",null,false]
[90,"Toiletries",null,null,null,"M",null,false]
[91,"Other costs",null,null,null,"M",null,false]
[null,"Total personal costs per month",null,{"$f":"Conversions!H162","v":0},null,{"$f":"IF($H$1=TRUE,'Spending Guidelines'!P14,\"\")","v":30}]
[]
[null,"Monthly total flexible cost outgoings",null,{"$f":"Conversions!H163","v":0}]
[]
[null,"Monthly total outgoings",null,{"$f":"Conversions!H164","v":0},null,null,null,{"$f":"IF(D34>Income!D40,\"Warning - Outgoings are more than Income\",\"\")","v":""}]
[]
[null,"Monthly Total Available for Creditors",null,{"$f":"Conversions!E371","v":0}]

{"sheet":"Savings","index":5,"n_rows":11,"n_cols":5,"rows_kept":11,"cut":false,"hidden":false,"merged":[[7,4,7,10]]}
[null,"Savings"]
[]
[null,null,null,"Amount (£) "]
[null,"Monthly saving amount\nEnter any savings amount agreed with the client here – if savings are not appropriate, leave this field blank. Savings contributions are limited to up-to-10% of monthly surplus income and should not exceed £20. If a value of over £20 is entered a warning message will show.",null,null,{"$f":"IF(D4>20,\"!!!\",\"\")","v":""}]
[null,"Please confirm that a monthly contribution to savings has been considered \n(or discussed with an adviser) ",null,false]
[null,"Tick here to opt-out of the savings contribution",null,false]
[]
[null,"Monthly Savings contribution",null,{"$f":"IF(D6=TRUE,0,D4)","v":0},{"$f":"IF(D8>20, \"Savings value is over £20.00, please check with advisor\",\"\")","v":""}]
[]
[]
[null,"Monthly Total Available for Creditors",null,{"$f":"Conversions!E384","v":0}]

{"sheet":"Debt Admin Fee","index":6,"n_rows":8,"n_cols":11,"rows_kept":8,"cut":false,"hidden":false,"merged":[]}
[]
[null,"Debt Administration Fee"]
[]
[null,null,"Advisers should consider any set up / admin fee and how this might be spread across the first period of payment amounts. "]
[null,null,"Please use the comments section below to explain any expected future change in this fee amount."]
[]
[null,null,"Debt Admin Fee",null,"Amount (£) ",null,"Frequency",null,"Include Note in statement",null,"Notes"]
[null,null,null,null,null,null,"M",null,false]

{"sheet":"Debts","index":7,"n_rows":213,"n_cols":27,"rows_kept":213,"cut":false,"hidden":false,"merged":[[104,7,104,16],[211,1,213,11],[208,1,208,3]]}
[null,"Debts - Priority and Non Priority"]
[]
[null,"Priority debts"]
[]
[null,"Creditor",null,"Owed (£) ",null,"Repayment offer (£)",null,"Offer Frequency",null,null,null,"Include Notes in statement",null,"Notes"]
[92,null,null,null,null,null,null,"M",null,null,null,false]
[93,null,null,null,null,null,null,"M",null,null,null,false]
[94,null,null,null,null,null,null,"M",null,null,null,false]
[95,null,null,null,null,null,null,"M",null,null,null,false]
[96,null,null,null,null,null,null,"M",null,null,null,false]
[97,null,null,null,null,null,null,"M",null,null,null,false]
[98,null,null,null,null,null,null,"M",null,null,null,false]
[99,null,null,null,null,null,null,"M",null,null,null,false]
[100,null,null,null,null,null,null,"M",null,null,null,false]
[101,null,null,null,null,null,null,"M",null,null,null,false]
[102,null,null,null,null,null,null,"M",null,null,null,false]
[103,null,null,null,null,null,null,"M",null,null,null,false]
[104,null,null,null,null,null,null,"M",null,null,null,false]
[105,null,null,null,null,null,null,"M",null,null,null,false]
[106,null,null,null,null,null,null,"M",null,null,null,false]
[107,null,null,null,null,null,null,"M",null,null,null,false]
[108,null,null,null,null,null,null,"M",null,null,null,false]
[109,null,null,null,null,null,null,"M",null,null,null,false]
[110,null,null,null,null,null,null,"M",null,null,null,false]
[111,null,null,null,null,null,null,"M",null,null,null,false]
[112,null,null,null,null,null,null,"M",null,null,null,false]
[113,null,null,null,null,null,null,"M",null,null,null,false]
[114,null,null,null,null,null,null,"M",null,null,null,false]
[115,null,null,null,null,null,null,"M",null,null,null,false]
[116,null,null,null,null,null,null,"M",null,null,null,false]
[117,null,null,null,null,null,null,"M",null,null,null,false]
[118,null,null,null,null,null,null,"M",null,null,null,false]
[119,null,null,null,null,null,null,"M",null,null,null,false]
[120,null,null,null,null,null,null,"M",null,null,null,false]
[121,null,null,null,null,null,null,"M",null,null,null,false]
[122,null,null,null,null,null,null,"M",null,null,null,false]
[123,null,null,null,null,null,null,"M",null,null,null,false]
[124,null,null,null,null,null,null,"M",null,null,null,false]
[125,null,null,null,null,null,null,"M",null,null,null,false]
[126,null,null,null,null,null,null,"M",null,null,null,false]
[127,null,null,null,null,null,null,"M",null,null,null,false]
[128,null,null,null,null,null,null,"M",null,null,null,false]
[129,null,null,null,null,null,null,"M",null,null,null,false]
[130,null,null,null,null,null,null,"M",null,null,null,false]
[131,null,null,null,null,null,null,"M",null,null,null,false]
[132,null,null,null,null,null,null,"M",null,null,null,false]
[133,null,null,null,null,null,null,"M",null,null,null,false]
[134,null,null,null,null,null,null,"M",null,null,null,false]
[135,null,null,null,null,null,null,"M",null,null,null,false]
[136,null,null,null,null,null,null,"M",null,null,null,false]
[137,null,null,null,null,null,null,"M",null,null,null,false]
[138,null,null,null,null,null,null,"M",null,null,null,false]
[139,null,null,null,null,null,null,"M",null,null,null,false]
[140,null,null,null,null,null,null,"M",null,null,null,false]
[141,null,null,null,null,null,null,"M",null,null,null,false]
[142,null,null,null,null,null,null,"M",null,null,null,false]
[143,null,null,null,null,null,null,"M",null,null,null,false]
[144,null,null,null,null,null,null,"M",null,null,null,false]
[145,null,null,null,null,null,null,"M",null,null,null,false]
[146,null,null,null,null,null,null,"M",null,null,null,false]
[147,null,null,null,null,null,null,"M",null,null,null,false]
[148,null,null,null,null,null,null,"M",null,null,null,false]
[149,null,null,null,null,null,null,"M",null,null,null,false]
[150,null,null,null,null,null,null,"M",null,null,null,false]
[151,null,null,null,null,null,null,"M",null,null,null,false]
[152,null,null,null,null,null,null,"M",null,null,null,false]
[153,null,null,null,null,null,null,"M",null,null,null,false]
[154,null,null,null,null,null,null,"M",null,null,null,false]
[155,null,null,null,null,null,null,"M",null,null,null,false]
[156,null,null,null,null,null,null,"M",null,null,null,false]
[157,null,null,null,null,null,null,"M",null,null,null,false]
[158,null,null,null,null,null,null,"M",null,null,null,false]
[159,null,null,null,null,null,null,"M",null,null,null,false]
[160,null,null,null,null,null,null,"M",null,null,null,false]
[161,null,null,null,null,null,null,"M",null,null,null,false]
[162,null,null,null,null,null,null,"M",null,null,null,false]
[163,null,null,null,null,null,null,"M",null,null,null,false]
[164,null,null,null,null,null,null,"M",null,null,null,false]
[165,null,null,null,null,null,null,"M",null,null,null,false]
[166,null,null,null,null,null,null,"M",null,null,null,false]
[167,null,null,null,null,null,null,"M",null,null,null,false]
[168,null,null,null,null,null,null,"M",null,null,null,false]
[169,null,null,null,null,null,null,"M",null,null,null,false]
[170,null,null,null,null,null,null,"M",null,null,null,false]
[171,null,null,null,null,null,null,"M",null,null,null,false]
[172,null,null,null,null,null,null,"M",null,null,null,false]
[173,null,null,null,null,null,null,"M",null,null,null,false]
[174,null,null,null,null,null,null,"M",null,null,null,false]
[175,null,null,null,null,null,null,"M",null,null,null,false]
[176,null,null,null,null,null,null,"M",null,null,null,false]
[177,null,null,null,null,null,null,"M",null,null,null,false]
[178,null,null,null,null,null,null,"M",null,null,null,false]
[179,null,null,null,null,null,null,"M",null,null,null,false]
[180,null,null,null,null,null,null,"M",null,null,null,false]
[181,null,null,null,null,null,null,"M",null,null,null,false]
[182,null,null,null,null,null,null,"M",null,null,null,false]
[183,null,null,null,null,null,null,"M",null,null,null,false]
[184,null,null,null,null,null,null,"M",null,null,null,false]
[185,null,null,null,null,null,null,"M",null,null,null,false]
[186,null,null,null,null,null,null,"M",null,null,null,false]
[187,null,null,null,null,null,null,"M",null,null,null,false]
[]
[null,"Total Priority debts",null,{"$f":"Conversions!$E$263","v":0},null,{"$f":"Conversions!$E$372","v":0}]
[]
[null,"Total for Non - Priority Creditors",null,null,null,{"$f":"Conversions!E373","v":0}]
[]
[null,"Non - Priority debts"]
[]
[null,"Creditor",null," Owed (£) ",null," Repayment\nCurrent / Offer\n(£)",null,"Offer Frequency",null,null,"CCJ Tick if yes","Override on Fin\nStatement\n(tick if yes)",null,"Notes","Include Notes in statement"]
[{"$f":"A101+1","v":188},null,null,null,{"$f":"IF(D110=\"\",\"\",Conversions!N268)","v":""},{"$f":"E110","v":""},null,"M",null,null,false,false,null,null,false]
[{"$f":"A110+1","v":189},null,null,null,{"$f":"IF(D111=\"\",\"\",Conversions!N269)","v":""},{"$f":"E111","v":""},null,"M",null,null,false,false,null,null,false]
[{"$f":"A111+1","v":190},null,null,null,{"$f":"IF(D112=\"\",\"\",Conversions!N270)","v":""},{"$f":"E112","v":""},null,"M",null,null,false,false,null,null,false]
[191,null,null,null,{"$f":"IF(D113=\"\",\"\",Conversions!N271)","v":""},"",null,"M",null,null,false,false,null,null,false]
[192,null,null,null,{"$f":"IF(D114=\"\",\"\",Conversions!N272)","v":""},"",null,"M",null,null,false,false,null,null,false]
[193,null,null,null,{"$f":"IF(D115=\"\",\"\",Conversions!N273)","v":""},"",null,"M",null,null,false,false,null,null,false]
[194,null,null,null,{"$f":"IF(D116=\"\",\"\",Conversions!N274)","v":""},"",null,"M",null,null,false,false,null,null,false]
[195,null,null,null,{"$f":"IF(D117=\"\",\"\",Conversions!N275)","v":""},"",null,"M",null,null,false,false,null,null,false]
[196,null,null,null,{"$f":"IF(D118=\"\",\"\",Conversions!N276)","v":""},"",null,"M",null,null,false,false,null,null,false]
[197,null,null,null,{"$f":"IF(D119=\"\",\"\",Conversions!N277)","v":""},"",null,"M",null,null,false,false,null,null,false]
[198,null,null,null,{"$f":"IF(D120=\"\",\"\",Conversions!N278)","v":""},"",null,"M",null,null,false,false,null,null,false,null,null,null,null,null,null,null,null,null,null,null,"`"]
[199,null,null,null,{"$f":"IF(D121=\"\",\"\",Conversions!N279)","v":""},"",null,"M",null,null,false,false,null,null,false]
[{"$f":"A121+1","v":200},null,null,null,{"$f":"IF(D122=\"\",\"\",Conversions!N280)","v":""},"",null,"M",null,null,false,false,null,null,false]
[201,null,null,null,{"$f":"IF(D123=\"\",\"\",Conversions!N281)","v":""},"",null,"M",null,null,false,false,null,null,false]
[202,null,null,null,{"$f":"IF(D124=\"\",\"\",Conversions!N282)","v":""},"",null,"M",null,null,false,false,null,null,false]
[203,null,null,null,{"$f":"IF(D125=\"\",\"\",Conversions!N283)","v":""},"",null,"M",null,null,false,false,null,null,false]
[204,null,null,null,{"$f":"IF(D126=\"\",\"\",Conversions!N284)","v":""},"",null,"M",null,null,false,false,null,null,false]
[205,null,null,null,{"$f":"IF(D127=\"\",\"\",Conversions!N285)","v":""},"",null,"M",null,null,false,false,null,null,false]
[206,null,null,null,{"$f":"IF(D128=\"\",\"\",Conversions!N286)","v":""},"",null,"M",null,null,false,false,null,null,false]
[207,null,null,null,{"$f":"IF(D129=\"\",\"\",Conversions!N287)","v":""},"",null,"M",null,null,false,false,null,null,false]
[208,null,null,null,{"$f":"IF(D130=\"\",\"\",Conversions!N288)","v":""},"",null,"M",null,null,false,false,null,null,false]
[209,null,null,null,{"$f":"IF(D131=\"\",\"\",Conversions!N289)","v":""},"",null,"M",null,null,false,false,null,null,false]
[210,null,null,null,{"$f":"IF(D132=\"\",\"\",Conversions!N290)","v":""},"",null,"M",null,null,false,false,null,null,false]
[211,null,null,null,{"$f":"IF(D133=\"\",\"\",Conversions!N291)","v":""},"",null,"M",null,null,false,false,null,null,false]
[212,null,null,null,{"$f":"IF(D134=\"\",\"\",Conversions!N292)","v":""},"",null,"M",null,null,false,false,null,null,false]
[213,null,null,null,{"$f":"IF(D135=\"\",\"\",Conversions!N293)","v":""},"",null,"M",null,null,false,false,null,null,false]
[214,null,null,null,{"$f":"IF(D136=\"\",\"\",Conversions!N294)","v":""},"",null,"M",null,null,false,false,null,null,false]
[215,null,null,null,{"$f":"IF(D137=\"\",\"\",Conversions!N295)","v":""},"",null,"M",null,null,false,false,null,null,false]
[216,null,null,null,{"$f":"IF(D138=\"\",\"\",Conversions!N296)","v":""},"",null,"M",null,null,false,false,null,null,false]
[217,null,null,null,{"$f":"IF(D139=\"\",\"\",Conversions!N297)","v":""},"",null,"M",null,null,false,false,null,null,false]
[218,null,null,null,{"$f":"IF(D140=\"\",\"\",Conversions!N298)","v":""},"",null,"M",null,null,false,false,null,null,false]
[219,null,null,null,{"$f":"IF(D141=\"\",\"\",Conversions!N299)","v":""},"",null,"M",null,null,false,false,null,null,false]
[220,null,null,null,{"$f":"IF(D142=\"\",\"\",Conversions!N300)","v":""},"",null,"M",null,null,false,false,null,null,false]
[221,null,null,null,{"$f":"IF(D143=\"\",\"\",Conversions!N301)","v":""},"",null,"M",null,null,false,false,null,null,false]
[222,null,null,null,{"$f":"IF(D144=\"\",\"\",Conversions!N302)","v":""},"",null,"M",null,null,false,false,null,null,false]
[223,null,null,null,{"$f":"IF(D145=\"\",\"\",Conversions!N303)","v":""},"",null,"M",null,null,false,false,null,null,false]
[224,null,null,null,{"$f":"IF(D146=\"\",\"\",Conversions!N304)","v":""},"",null,"M",null,null,false,false,null,null,false]
[225,null,null,null,{"$f":"IF(D147=\"\",\"\",Conversions!N305)","v":""},"",null,"M",null,null,false,false,null,null,false]
[226,null,null,null,{"$f":"IF(D148=\"\",\"\",Conversions!N306)","v":""},"",null,"M",null,null,false,false,null,null,false]
[227,null,null,null,{"$f":"IF(D149=\"\",\"\",Conversions!N307)","v":""},"",null,"M",null,null,false,false,null,null,false]
[228,null,null,null,{"$f":"IF(D150=\"\",\"\",Conversions!N308)","v":""},"",null,"M",null,null,false,false,null,null,false]
[229,null,null,null,{"$f":"IF(D151=\"\",\"\",Conversions!N309)","v":""},"",null,"M",null,null,false,false,null,null,false]
[230,null,null,null,{"$f":"IF(D152=\"\",\"\",Conversions!N310)","v":""},"",null,"M",null,null,false,false,null,null,false]
[231,null,null,null,{"$f":"IF(D153=\"\",\"\",Conversions!N311)","v":""},"",null,"M",null,null,false,false,null,null,false]
[232,null,null,null,{"$f":"IF(D154=\"\",\"\",Conversions!N312)","v":""},"",null,"M",null,null,false,false,null,null,false]
[233,null,null,null,{"$f":"IF(D155=\"\",\"\",Conversions!N313)","v":""},"",null,"M",null,null,false,false,null,null,false]
[234,null,null,null,{"$f":"IF(D156=\"\",\"\",Conversions!N314)","v":""},"",null,"M",null,null,false,false,null,null,false]
[235,null,null,null,{"$f":"IF(D157=\"\",\"\",Conversions!N315)","v":""},"",null,"M",null,null,false,false,null,null,false]
[236,null,null,null,{"$f":"IF(D158=\"\",\"\",Conversions!N316)","v":""},"",null,"M",null,null,false,false,null,null,false]
[237,null,null,null,{"$f":"IF(D159=\"\",\"\",Conversions!N317)","v":""},"",null,"M",null,null,false,false,null,null,false]
[238,null,null,null,{"$f":"IF(D160=\"\",\"\",Conversions!N318)","v":""},"",null,"M",null,null,false,false,null,null,false]
[239,null,null,null,{"$f":"IF(D161=\"\",\"\",Conversions!N319)","v":""},"",null,"M",null,null,false,false,null,null,false]
[240,null,null,null,{"$f":"IF(D162=\"\",\"\",Conversions!N320)","v":""},"",null,"M",null,null,false,false,null,null,false]
[241,null,null,null,{"$f":"IF(D163=\"\",\"\",Conversions!N321)","v":""},"",null,"M",null,null,false,false,null,null,false]
[242,null,null,null,{"$f":"IF(D164=\"\",\"\",Conversions!N322)","v":""},"",null,"M",null,null,false,false,null,null,false]
[243,null,null,null,{"$f":"IF(D165=\"\",\"\",Conversions!N323)","v":""},"",null,"M",null,null,false,false,null,null,false]
[244,null,null,null,{"$f":"IF(D166=\"\",\"\",Conversions!N324)","v":""},"",null,"M",null,null,false,false,null,null,false]
[245,null,null,null,{"$f":"IF(D167=\"\",\"\",Conversions!N325)","v":""},"",null,"M",null,null,false,false,null,null,false]
[246,null,null,null,{"$f":"IF(D168=\"\",\"\",Conversions!N326)","v":""},"",null,"M",null,null,false,false,null,null,false]
[247,null,null,null,{"$f":"IF(D169=\"\",\"\",Conversions!N327)","v":""},"",null,"M",null,null,false,false,null,null,false]
[248,null,null,null,{"$f":"IF(D170=\"\",\"\",Conversions!N328)","v":""},"",null,"M",null,null,false,false,null,null,false]
[249,null,null,null,{"$f":"IF(D171=\"\",\"\",Conversions!N329)","v":""},"",null,"M",null,null,false,false,null,null,false]
[250,null,null,null,{"$f":"IF(D172=\"\",\"\",Conversions!N330)","v":""},"",null,"M",null,null,false,false,null,null,false]
[251,null,null,null,{"$f":"IF(D173=\"\",\"\",Conversions!N331)","v":""},"",null,"M",null,null,false,false,null,null,false]
[252,null,null,null,{"$f":"IF(D174=\"\",\"\",Conversions!N332)","v":""},"",null,"M",null,null,false,false,null,null,false]
[253,null,null,null,{"$f":"IF(D175=\"\",\"\",Conversions!N333)","v":""},"",null,"M",null,null,false,false,null,null,false]
[{"$f":"A175+1","v":254},null,null,null,{"$f":"IF(D176=\"\",\"\",Conversions!N334)","v":""},{"$f":"E176","v":""},null,"M",null,null,false,false,null,null,false]
[255,null,null,null,{"$f":"IF(D177=\"\",\"\",Conversions!N335)","v":""},"",null,"M",null,null,false,false,null,null,false]
[256,null,null,null,{"$f":"IF(D178=\"\",\"\",Conversions!N336)","v":""},"",null,"M",null,null,false,false,null,null,false]
[257,null,null,null,{"$f":"IF(D179=\"\",\"\",Conversions!N337)","v":""},"",null,"M",null,null,false,false,null,null,false]
[258,null,null,null,{"$f":"IF(D180=\"\",\"\",Conversions!N338)","v":""},"",null,"M",null,null,false,false,null,null,false]
[259,null,null,null,{"$f":"IF(D181=\"\",\"\",Conversions!N339)","v":""},"",null,"M",null,null,false,false,null,null,false]
[260,null,null,null,{"$f":"IF(D182=\"\",\"\",Conversions!N340)","v":""},"",null,"M",null,null,false,false,null,null,false]
[261,null,null,null,{"$f":"IF(D183=\"\",\"\",Conversions!N341)","v":""},"",null,"M",null,null,false,false,null,null,false]
[262,null,null,null,{"$f":"IF(D184=\"\",\"\",Conversions!N342)","v":""},"",null,"M",null,null,false,false,null,null,false]
[263,null,null,null,{"$f":"IF(D185=\"\",\"\",Conversions!N343)","v":""},"",null,"M",null,null,false,false,null,null,false]
[264,null,null,null,{"$f":"IF(D186=\"\",\"\",Conversions!N344)","v":""},"",null,"M",null,null,false,false,null,null,false]
[265,null,null,null,{"$f":"IF(D187=\"\",\"\",Conversions!N345)","v":""},"",null,"M",null,null,false,false,null,null,false]
[266,null,null,null,{"$f":"IF(D188=\"\",\"\",Conversions!N346)","v":""},"",null,"M",null,null,false,false,null,null,false]
[267,null,null,null,{"$f":"IF(D189=\"\",\"\",Conversions!N347)","v":""},"",null,"M",null,null,false,false,null,null,false]
[268,null,null,null,{"$f":"IF(D190=\"\",\"\",Conversions!N348)","v":""},"",null,"M",null,null,false,false,null,null,false]
[269,null,null,null,{"$f":"IF(D191=\"\",\"\",Conversions!N349)","v":""},"",null,"M",null,null,false,false,null,null,false]
[270,null,null,null,{"$f":"IF(D192=\"\",\"\",Conversions!N350)","v":""},"",null,"M",null,null,false,false,null,null,false]
[271,null,null,null,{"$f":"IF(D193=\"\",\"\",Conversions!N351)","v":""},"",null,"M",null,null,false,false,null,null,false]
[272,null,null,null,{"$f":"IF(D194=\"\",\"\",Conversions!N352)","v":""},"",null,"M",null,null,false,false,null,null,false]
[273,null,null,null,{"$f":"IF(D195=\"\",\"\",Conversions!N353)","v":""},"",null,"M",null,null,false,false,null,null,false]
[274,null,null,null,{"$f":"IF(D196=\"\",\"\",Conversions!N354)","v":""},"",null,"M",null,null,false,false,null,null,false]
[275,null,null,null,{"$f":"IF(D197=\"\",\"\",Conversions!N355)","v":""},"",null,"M",null,null,false,false,null,null,false]
[276,null,null,null,{"$f":"IF(D198=\"\",\"\",Conversions!N356)","v":""},"",null,"M",null,null,false,false,null,null,false]
[277,null,null,null,{"$f":"IF(D199=\"\",\"\",Conversions!N357)","v":""},"",null,"M",null,null,false,false,null,null,false]
[278,null,null,null,{"$f":"IF(D200=\"\",\"\",Conversions!N358)","v":""},"",null,"M",null,null,false,false,null,null,false]
[279,null,null,null,{"$f":"IF(D201=\"\",\"\",Conversions!N359)","v":""},"",null,"M",null,null,false,false,null,null,false]
[280,null,null,null,{"$f":"IF(D202=\"\",\"\",Conversions!N360)","v":""},"",null,"M",null,null,false,false,null,null,false]
[281,null,null,null,{"$f":"IF(D203=\"\",\"\",Conversions!N361)","v":""},"",null,"M",null,null,false,false,null,null,false]
[282,null,null,null,{"$f":"IF(D204=\"\",\"\",Conversions!N362)","v":""},"",null,"M",null,null,false,false,null,null,false]
[283,null,null,null,{"$f":"IF(D205=\"\",\"\",Conversions!N363)","v":""},"",null,"M",null,null,false,false,null,null,false]
[]
[null,"Total Non - Priority debts",null,{"$f":"Conversions!E365","v":0},null,{"$f":"Conversions!H365","v":0}]
[]
[null,"Total Fixed Non Priority Payments ",null,null,null,{"$f":"Conversions!E375","v":0},null,null,null,null,null,null,null,"Token Payments",0]
[]
[null,null,null,null,null,null,null,null,null,null,null,null,null,"Round to nearest",0]
[null,{"$f":"IF(ISERROR(Conversions!O365),\"\",IF(Conversions!O365>Conversions!E373,\"WARNING!!! - Payments now exceed amount available, please review.\",\"\"))","v":""}]
[null,null,null,null,null,null,null,null,null,null,null,null,null,"Years to repay Non-priority Debts",{"$f":"Conversions!E382","v":0}]

{"sheet":"Notes(2)","index":8,"n_rows":246,"n_cols":6,"rows_kept":246,"cut":false,"hidden":true,"merged":[]}
[]
[null,{"$f":"IF(Conversions!P10=TRUE,\"In\",\"Out\")","v":"Out"},{"$f":"Conversions!Q10","v":""},"Additional notes (e.g. Reasons for debt, circumstances, temporary situations)\nPLEASE NOTE: previous comments will be shown here, please add further notes at the bottom - click show continuation sheet for all notes."]
[null,{"$f":"IF(Conversions!P11=TRUE,\"In\",\"Out\")","v":"Out"},{"$f":"Conversions!Q11","v":""},{"$f":"IFERROR(INDEX(C$2:C$295,SMALL(IF(B$2:B$295=\"In\",ROW(C$2:C$295)-ROW(C$2)+1),ROW(C1))),\"\")","v":""},"e.g. Made redundant in June 2014 and was out of work for 6 months","e.g. Made redundant in June 2014 and was out of work for 6 months"]
[null,{"$f":"IF(Conversions!P12=TRUE,\"In\",\"Out\")","v":"Out"},{"$f":"Conversions!Q12","v":""},{"$f":"IFERROR(INDEX(C$2:C$295,SMALL(IF(B$2:B$295=\"In\",ROW(C$2:C$295)-ROW(C$2)+1),ROW(C2))),\"\")","v":""},"e.g. Communications and Leisure: Mobile phone - client has multiple family members abroad","e.g. Communications and Leisure: Mobile phone - client has multiple family members abroad"]
[null,{"$f":"IF(Conversions!P17=TRUE,\"In\",\"Out\")","v":"Out"},{"$f":"Conversions!Q17","v":""},{"$f":"IFERROR(INDEX(C$2:C$295,SMALL(IF(B$2:B$295=\"In\",ROW(C$2:C$295)-ROW(C$2)+1),ROW(C3))),\"\")","v":""}]
[null,{"$f":"IF(Conversions!P18=TRUE,\"In\",\"Out\")","v":"Out"},{"$f":"Conversions!Q18","v":""},{"$f":"IFERROR(INDEX(C$2:C$295,SMALL(IF(B$2:B$295=\"In\",ROW(C$2:C$295)-ROW(C$2)+1),ROW(C4))),\"\")","v":""}]
[null,{"$f":"IF(Conversions!P19=TRUE,\"In\",\"Out\")","v":"Out"},{"$f":"Conversions!Q19","v":""},{"$f":"IFERROR(INDEX(C$2:C$295,SMALL(IF(B$2:B$295=\"In\",ROW(C$2:C$295)-ROW(C$2)+1),ROW(C5))),\"\")","v":""}]
[null,{"$f":"IF(Conversions!P20=TRUE,\"In\",\"Out\")","v":"Out"},{"$f":"Conversions!Q20","v":""},{"$f":"IFERROR(INDEX(C$2:C$295,SMALL(IF(B$2:B$295=\"In\",ROW(C$2:C$295)-ROW(C$2)+1),ROW(C6))),\"\")","v":""}]
[null,{"$f":"IF(Conversions!P21=TRUE,\"In\",\"Out\")","v":"Out"},{"$f":"Conversions!Q21","v":""},{"$f":"IFERROR(INDEX(C$2:C$295,SMALL(IF(B$2:B$295=\"In\",ROW(C$2:C$295)-ROW(C$2)+1),ROW(C7))),\"\")","v":""}]
[null,{"$f":"IF(Conversions!P22=TRUE,\"In\",\"Out\")","v":"Out"},{"$f":"Conversions!Q22","v":""},{"$f":"IFERROR(INDEX(C$2:C$295,SMALL(IF(B$2:B$295=\"In\",ROW(C$2:C$295)-ROW(C$2)+1),ROW(C8))),\"\")","v":""}]
[null,{"$f":"IF(Conversions!P23=TRUE,\"In\",\"Out\")","v":"Out"},{"$f":"Conversions!Q23","v":""},{"$f":"IFERROR(INDEX(C$2:C$295,SMALL(IF(B$2:B$295=\"In\",ROW(C$2:C$295)-ROW(C$2)+1),ROW(C9))),\"\")","v":""}]
[null,{"$f":"IF(Conversions!P24=TRUE,\"In\",\"Out\")","v":"Out"},{"$f":"Conversions!Q24","v":""},{"$f":"IFERROR(INDEX(C$2:C$295,SMALL(IF(B$2:B$295=\"In\",ROW(C$2:C$295)-ROW(C$2)+1),ROW(C10))),\"\")","v":""}]
[null,{"$f":"IF(Conversions!P25=TRUE,\"In\",\"Out\")","v":"Out"},{"$f":"Conversions!Q25","v":""},{"$f":"IFERROR(INDEX(C$2:C$295,SMALL(IF(B$2:B$295=\"In\",ROW(C$2:C$295)-ROW(C$2)+1),ROW(C11))),\"\")","v":""}]
[null,{"$f":"IF(Conversions!P26=TRUE,\"In\",\"Out\")","v":"Out"},{"$f":"Conversions!Q26","v":""},{"$f":"IFERROR(INDEX(C$2:C$295,SMALL(IF(B$2:B$295=\"In\",ROW(C$2:C$295)-ROW(C$2)+1),ROW(C12))),\"\")","v":""}]
[null,{"$f":"IF(Conversions!P27=TRUE,\"In\",\"Out\")","v":"Out"},{"$f":"Conversions!Q27","v":""},{"$f":"IFERROR(INDEX(C$2:C$295,SMALL(IF(B$2:B$295=\"In\",ROW(C$2:C$295)-ROW(C$2)+1),ROW(C13))),\"\")","v":""}]
[null,{"$f":"IF(Conversions!P28=TRUE,\"In\",\"Out\")","v":"Out"},{"$f":"Conversions!Q28","v":""},{"$f":"IFERROR(INDEX(C$2:C$295,SMALL(IF(B$2:B$295=\"In\",ROW(C$2:C$295)-ROW(C$2)+1),ROW(C14))),\"\")","v":""}]
[null,{"$f":"IF(Conversions!P29=TRUE,\"In\",\"Out\")","v":"Out"},{"$f":"Conversions!Q29","v":""},{"$f":"IFERROR(INDEX(C$2:C$295,SMALL(IF(B$2:B$295=\"In\",ROW(C$2:C$295)-ROW(C$2)+1),ROW(C15))),\"\")","v":""}]
[null,{"$f":"IF(Conversions!P33=TRUE,\"In\",\"Out\")","v":"Out"},{"$f":"Conversions!Q33","v":""},{"$f":"IFERROR(INDEX(C$2:C$295,SMALL(IF(B$2:B$295=\"In\",ROW(C$2:C$295)-ROW(C$2)+1),ROW(C16))),\"\")","v":""}]
[null,{"$f":"IF(Conversions!P34=TRUE,\"In\",\"Out\")","v":"Out"},{"$f":"Conversions!Q34","v":""},{"$f":"IFERROR(INDEX(C$2:C$295,SMALL(IF(B$2:B$295=\"In\",ROW(C$2:C$295)-ROW(C$2)+1),ROW(C17))),\"\")","v":""}]
[null,{"$f":"IF(Conversions!P35=TRUE,\"In\",\"Out\")","v":"Out"},{"$f":"Conversions!Q35","v":""},{"$f":"IFERROR(INDEX(C$2:C$295,SMALL(IF(B$2:B$295=\"In\",ROW(C$2:C$295)-ROW(C$2)+1),ROW(C18))),\"\")","v":""}]
[null,{"$f":"IF(Conversions!P36=TRUE,\"In\",\"Out\")","v":"Out"},{"$f":"Conversions!Q36","v":""},{"$f":"IFERROR(INDEX(C$2:C$295,SMALL(IF(B$2:B$295=\"In\",ROW(C$2:C$295)-ROW(C$2)+1),ROW(C19))),\"\")","v":""}]
[null,{"$f":"IF(Conversions!P41=TRUE,\"In\",\"Out\")","v":"Out"},{"$f":"Conversions!Q41","v":""},{"$f":"IFERROR(INDEX(C$2:C$295,SMALL(IF(B$2:B$295=\"In\",ROW(C$2:C$295)-ROW(C$2)+1),ROW(C20))),\"\")","v":""}]
[null,{"$f":"IF(Conversions!P42=TRUE,\"In\",\"Out\")","v":"Out"},{"$f":"Conversions!Q42","v":""},{"$f":"IFERROR(INDEX(C$2:C$295,SMALL(IF(B$2:B$295=\"In\",ROW(C$2:C$295)-ROW(C$2)+1),ROW(C21))),\"\")","v":""}]
[null,{"$f":"IF(Conversions!P43=TRUE,\"In\",\"Out\")","v":"Out"},{"$f":"Conversions!Q43","v":""},{"$f":"IFERROR(INDEX(C$2:C$295,SMALL(IF(B$2:B$295=\"In\",ROW(C$2:C$295)-ROW(C$2)+1),ROW(C22))),\"\")","v":""}]
[null,{"$f":"IF(Conversions!P44=TRUE,\"In\",\"Out\")","v":"Out"},{"$f":"Conversions!Q44","v":""},{"$f":"IFERROR(INDEX(C$2:C$295,SMALL(IF(B$2:B$295=\"In\",ROW(C$2:C$295)-ROW(C$2)+1),ROW(C23))),\"\")","v":""}]
[null,{"$f":"IF(Conversions!P45=TRUE,\"In\",\"Out\")","v":"Out"},{"$f":"Conversions!Q45","v":""},{"$f":"IFERROR(INDEX(C$2:C$295,SMALL(IF(B$2:B$295=\"In\",ROW(C$2:C$295)-ROW(C$2)+1),ROW(C24))),\"\")","v":""}]
[null,{"$f":"IF(Conversions!P52=TRUE,\"In\",\"Out\")","v":"Out"},{"$f":"Conversions!Q52","v":""},{"$f":"IFERROR(INDEX(C$2:C$295,SMALL(IF(B$2:B$295=\"In\",ROW(C$2:C$295)-ROW(C$2)+1),ROW(C25))),\"\")","v":""}]
[null,{"$f":"IF(Conversions!P53=TRUE,\"In\",\"Out\")","v":"Out"},{"$f":"Conversions!Q53","v":""},{"$f":"IFERROR(INDEX(C$2:C$295,SMALL(IF(B$2:B$295=\"In\",ROW(C$2:C$295)-ROW(C$2)+1),ROW(C26))),\"\")","v":""}]
[null,{"$f":"IF(Conversions!P54=TRUE,\"In\",\"Out\")","v":"Out"},{"$f":"Conversions!Q54","v":""},{"$f":"IFERROR(INDEX(C$2:C$295,SMALL(IF(B$2:B$295=\"In\",ROW(C$2:C$295)-ROW(C$2)+1),ROW(C27))),\"\")","v":""}]
[null,{"$f":"IF(Conversions!P55=TRUE,\"In\",\"Out\")","v":"Out"},{"$f":"Conversions!Q55","v":""},{"$f":"IFERROR(INDEX(C$2:C$295,SMALL(IF(B$2:B$295=\"In\",ROW(C$2:C$295)-ROW(C$2)+1),ROW(C28))),\"\")","v":""}]
[null,{"$f":"IF(Conversions!P56=TRUE,\"In\",\"Out\")","v":"Out"},{"$f":"Conversions!Q56","v":""},{"$f":"IFERROR(INDEX(C$2:C$295,SMALL(IF(B$2:B$295=\"In\",ROW(C$2:C$295)-ROW(C$2)+1),ROW(C29))),\"\")","v":""}]
[null,{"$f":"IF(Conversions!P57=TRUE,\"In\",\"Out\")","v":"Out"},{"$f":"Conversions!Q57","v":""},{"$f":"IFERROR(INDEX(C$2:C$295,SMALL(IF(B$2:B$295=\"In\",ROW(C$2:C$295)-ROW(C$2)+1),ROW(C30))),\"\")","v":""}]
[null,{"$f":"IF(Conversions!P58=TRUE,\"In\",\"Out\")","v":"Out"},{"$f":"Conversions!Q58","v":""},{"$f":"IFERROR(INDEX(C$2:C$295,SMALL(IF(B$2:B$295=\"In\",ROW(C$2:C$295)-ROW(C$2)+1),ROW(C31))),\"\")","v":""}]
[null,{"$f":"IF(Conversions!P59=TRUE,\"In\",\"Out\")","v":"Out"},{"$f":"Conversions!Q59","v":""},{"$f":"IFERROR(INDEX(C$2:C$295,SMALL(IF(B$2:B$295=\"In\",ROW(C$2:C$295)-ROW(C$2)+1),ROW(C32))),\"\")","v":""}]
[null,{"$f":"IF(Conversions!P60=TRUE,\"In\",\"Out\")","v":"Out"},{"$f":"Conversions!Q60","v":""},{"$f":"IFERROR(INDEX(C$2:C$295,SMALL(IF(B$2:B$295=\"In\",ROW(C$2:C$295)-ROW(C$2)+1),ROW(C33))),\"\")","v":""}]
[null,{"$f":"IF(Conversions!P64=TRUE,\"In\",\"Out\")","v":"Out"},{"$f":"Conversions!Q64","v":""},{"$f":"IFERROR(INDEX(C$2:C$295,SMALL(IF(B$2:B$295=\"In\",ROW(C$2:C$295)-ROW(C$2)+1),ROW(C34))),\"\")","v":""}]
[null,{"$f":"IF(Conversions!P65=TRUE,\"In\",\"Out\")","v":"Out"},{"$f":"Conversions!Q65","v":""},{"$f":"IFERROR(INDEX(C$2:C$295,SMALL(IF(B$2:B$295=\"In\",ROW(C$2:C$295)-ROW(C$2)+1),ROW(C35))),\"\")","v":""}]
[null,{"$f":"IF(Conversions!P66=TRUE,\"In\",\"Out\")","v":"Out"},{"$f":"Conversions!Q66","v":""},{"$f":"IFERROR(INDEX(C$2:C$295,SMALL(IF(B$2:B$295=\"In\",ROW(C$2:C$295)-ROW(C$2)+1),ROW(C36))),\"\")","v":""}]
[null,{"$f":"IF(Conversions!P67=TRUE,\"In\",\"Out\")","v":"Out"},{"$f":"Conversions!Q67","v":""},{"$f":"IFERROR(INDEX(C$2:C$295,SMALL(IF(B$2:B$295=\"In\",ROW(C$2:C$295)-ROW(C$2)+1),ROW(C38))),\"\")","v":""}]
[null,{"$f":"IF(Conversions!P72=TRUE,\"In\",\"Out\")","v":"Out"},{"$f":"Conversions!Q72","v":""},{"$f":"IFERROR(INDEX(C$2:C$295,SMALL(IF(B$2:B$295=\"In\",ROW(C$2:C$295)-ROW(C$2)+1),ROW(#REF!))),\"\")","v":""}]
[null,{"$f":"IF(Conversions!P73=TRUE,\"In\",\"Out\")","v":"Out"},{"$f":"Conversions!Q73","v":""},{"$f":"IFERROR(INDEX(C$2:C$295,SMALL(IF(B$2:B$295=\"In\",ROW(C$2:C$295)-ROW(C$2)+1),ROW(C39))),\"\")","v":""}]
[null,{"$f":"IF(Conversions!P78=TRUE,\"In\",\"Out\")","v":"Out"},{"$f":"Conversions!Q78","v":""},{"$f":"IFERROR(INDEX(C$2:C$295,SMALL(IF(B$2:B$295=\"In\",ROW(C$2:C$295)-ROW(C$2)+1),ROW(C40))),\"\")","v":""}]
[null,{"$f":"IF(Conversions!P79=TRUE,\"In\",\"Out\")","v":"Out"},{"$f":"Conversions!Q79","v":""},{"$f":"IFERROR(INDEX(C$2:C$295,SMALL(IF(B$2:B$295=\"In\",ROW(C$2:C$295)-ROW(C$2)+1),ROW(C41))),\"\")","v":""}]
[null,{"$f":"IF(Conversions!P80=TRUE,\"In\",\"Out\")","v":"Out"},{"$f":"Conversions!Q80","v":""},{"$f":"IFERROR(INDEX(C$2:C$295,SMALL(IF(B$2:B$295=\"In\",ROW(C$2:C$295)-ROW(C$2)+1),ROW(C42))),\"\")","v":""}]
[null,{"$f":"IF(Conversions!P81=TRUE,\"In\",\"Out\")","v":"Out"},{"$f":"Conversions!Q81","v":""},{"$f":"IFERROR(INDEX(C$2:C$295,SMALL(IF(B$2:B$295=\"In\",ROW(C$2:C$295)-ROW(C$2)+1),ROW(C43))),\"\")","v":""}]
[null,{"$f":"IF(Conversions!P82=TRUE,\"In\",\"Out\")","v":"Out"},{"$f":"Conversions!Q82","v":""},{"$f":"IFERROR(INDEX(C$2:C$295,SMALL(IF(B$2:B$295=\"In\",ROW(C$2:C$295)-ROW(C$2)+1),ROW(C44))),\"\")","v":""}]
[null,{"$f":"IF(Conversions!P83=TRUE,\"In\",\"Out\")","v":"Out"},{"$f":"Conversions!Q83","v":""},{"$f":"IFERROR(INDEX(C$2:C$295,SMALL(IF(B$2:B$295=\"In\",ROW(C$2:C$295)-ROW(C$2)+1),ROW(C45))),\"\")","v":""}]
[null,{"$f":"IF(Conversions!P88=TRUE,\"In\",\"Out\")","v":"Out"},{"$f":"Conversions!Q88","v":""},{"$f":"IFERROR(INDEX(C$2:C$295,SMALL(IF(B$2:B$295=\"In\",ROW(C$2:C$295)-ROW(C$2)+1),ROW(C46))),\"\")","v":""}]
[null,{"$f":"IF(Conversions!P89=TRUE,\"In\",\"Out\")","v":"Out"},{"$f":"Conversions!Q89","v":""},{"$f":"IFERROR(INDEX(C$2:C$295,SMALL(IF(B$2:B$295=\"In\",ROW(C$2:C$295)-ROW(C$2)+1),ROW(C47))),\"\")","v":""}]
[null,{"$f":"IF(Conversions!P90=TRUE,\"In\",\"Out\")","v":"Out"},{"$f":"Conversions!Q90","v":""},{"$f":"IFERROR(INDEX(C$2:C$295,SMALL(IF(B$2:B$295=\"In\",ROW(C$2:C$295)-ROW(C$2)+1),ROW(C48))),\"\")","v":""}]
[null,{"$f":"IF(Conversions!P91=TRUE,\"In\",\"Out\")","v":"Out"},{"$f":"Conversions!Q91","v":""},{"$f":"IFERROR(INDEX(C$2:C$295,SMALL(IF(B$2:B$295=\"In\",ROW(C$2:C$295)-ROW(C$2)+1),ROW(C49))),\"\")","v":""}]
[null,{"$f":"IF(Conversions!P92=TRUE,\"In\",\"Out\")","v":"Out"},{"$f":"Conversions!Q92","v":""},{"$f":"IFERROR(INDEX(C$2:C$295,SMALL(IF(B$2:B$295=\"In\",ROW(C$2:C$295)-ROW(C$2)+1),ROW(C50))),\"\")","v":""}]
[null,{"$f":"IF(Conversions!P93=TRUE,\"In\",\"Out\")","v":"Out"},{"$f":"Conversions!Q93","v":""},{"$f":"IFERROR(INDEX(C$2:C$295,SMALL(IF(B$2:B$295=\"In\",ROW(C$2:C$295)-ROW(C$2)+1),ROW(C51))),\"\")","v":""}]
[null,{"$f":"IF(Conversions!P94=TRUE,\"In\",\"Out\")","v":"Out"},{"$f":"Conversions!Q94","v":""},{"$f":"IFERROR(INDEX(C$2:C$295,SMALL(IF(B$2:B$295=\"In\",ROW(C$2:C$295)-ROW(C$2)+1),ROW(C52))),\"\")","v":""}]
[null,{"$f":"IF(Conversions!P95=TRUE,\"In\",\"Out\")","v":"Out"},{"$f":"Conversions!Q95","v":""},{"$f":"IFERROR(INDEX(C$2:C$295,SMALL(IF(B$2:B$295=\"In\",ROW(C$2:C$295)-ROW(C$2)+1),ROW(C53))),\"\")","v":""}]
[null,{"$f":"IF(Conversions!P100=TRUE,\"In\",\"Out\")","v":"Out"},{"$f":"Conversions!Q100","v":""},{"$f":"IFERROR(INDEX(C$2:C$295,SMALL(IF(B$2:B$295=\"In\",ROW(C$2:C$295)-ROW(C$2)+1),ROW(C54))),\"\")","v":""}]
[null,{"$f":"IF(Conversions!P101=TRUE,\"In\",\"Out\")","v":"Out"},{"$f":"Conversions!Q101","v":""},{"$f":"IFERROR(INDEX(C$2:C$295,SMALL(IF(B$2:B$295=\"In\",ROW(C$2:C$295)-ROW(C$2)+1),ROW(C55))),\"\")","v":""}]
[null,{"$f":"IF(Conversions!P102=TRUE,\"In\",\"Out\")","v":"Out"},{"$f":"Conversions!Q102","v":""},{"$f":"IFERROR(INDEX(C$2:C$295,SMALL(IF(B$2:B$295=\"In\",ROW(C$2:C$295)-ROW(C$2)+1),ROW(C56))),\"\")","v":""}]
[null,{"$f":"IF(Conversions!P107=TRUE,\"In\",\"Out\")","v":"Out"},{"$f":"Conversions!Q107","v":""},{"$f":"IFERROR(INDEX(C$2:C$295,SMALL(IF(B$2:B$295=\"In\",ROW(C$2:C$295)-ROW(C$2)+1),ROW(C57))),\"\")","v":""}]
[null,{"$f":"IF(Conversions!P108=TRUE,\"In\",\"Out\")","v":"Out"},{"$f":"Conversions!Q108","v":""},{"$f":"IFERROR(INDEX(C$2:C$295,SMALL(IF(B$2:B$295=\"In\",ROW(C$2:C$295)-ROW(C$2)+1),ROW(C58))),\"\")","v":""}]
[null,{"$f":"IF(Conversions!P109=TRUE,\"In\",\"Out\")","v":"Out"},{"$f":"Conversions!Q109","v":""},{"$f":"IFERROR(INDEX(C$2:C$295,SMALL(IF(B$2:B$295=\"In\",ROW(C$2:C$295)-ROW(C$2)+1),ROW(C59))),\"\")","v":""}]
[null,{"$f":"IF(Conversions!P110=TRUE,\"In\",\"Out\")","v":"Out"},{"$f":"Conversions!Q110","v":""},{"$f":"IFERROR(INDEX(C$2:C$295,SMALL(IF(B$2:B$295=\"In\",ROW(C$2:C$295)-ROW(C$2)+1),ROW(C60))),\"\")","v":""}]
[null,{"$f":"IF(Conversions!P111=TRUE,\"In\",\"Out\")","v":"Out"},{"$f":"Conversions!Q111","v":""},{"$f":"IFERROR(INDEX(C$2:C$295,SMALL(IF(B$2:B$295=\"In\",ROW(C$2:C$295)-ROW(C$2)+1),ROW(C61))),\"\")","v":""}]
[null,{"$f":"IF(Conversions!P122=TRUE,\"In\",\"Out\")","v":"Out"},{"$f":"Conversions!Q122","v":""}]
[null,{"$f":"IF(Conversions!P123=TRUE,\"In\",\"Out\")","v":"Out"},{"$f":"Conversions!Q123","v":""},{"$f":"IFERROR(INDEX(C$2:C$295,SMALL(IF(B$2:B$295=\"In\",ROW(C$2:C$295)-ROW(C$2)+1),ROW(C62))),\"\")","v":""}]
[null,{"$f":"IF(Conversions!P124=TRUE,\"In\",\"Out\")","v":"Out"},{"$f":"Conversions!Q124","v":""},{"$f":"IFERROR(INDEX(C$2:C$295,SMALL(IF(B$2:B$295=\"In\",ROW(C$2:C$295)-ROW(C$2)+1),ROW(C63))),\"\")","v":""}]
[null,{"$f":"IF(Conversions!P125=TRUE,\"In\",\"Out\")","v":"Out"},{"$f":"Conversions!Q125","v":""},{"$f":"IFERROR(INDEX(C$2:C$295,SMALL(IF(B$2:B$295=\"In\",ROW(C$2:C$295)-ROW(C$2)+1),ROW(C65))),\"\")","v":""}]
[null,{"$f":"IF(Conversions!P126=TRUE,\"In\",\"Out\")","v":"Out"},{"$f":"Conversions!Q126","v":""},{"$f":"IFERROR(INDEX(C$2:C$295,SMALL(IF(B$2:B$295=\"In\",ROW(C$2:C$295)-ROW(C$2)+1),ROW(C66))),\"\")","v":""}]
[null,{"$f":"IF(Conversions!P133=TRUE,\"In\",\"Out\")","v":"Out"},{"$f":"Conversions!Q133","v":""},{"$f":"IFERROR(INDEX(C$2:C$295,SMALL(IF(B$2:B$295=\"In\",ROW(C$2:C$295)-ROW(C$2)+1),ROW(C67))),\"\")","v":""}]
[null,{"$f":"IF(Conversions!P134=TRUE,\"In\",\"Out\")","v":"Out"},{"$f":"Conversions!Q134","v":""},{"$f":"IFERROR(INDEX(C$2:C$295,SMALL(IF(B$2:B$295=\"In\",ROW(C$2:C$295)-ROW(C$2)+1),ROW(C68))),\"\")","v":""}]
[null,{"$f":"IF(Conversions!P135=TRUE,\"In\",\"Out\")","v":"Out"},{"$f":"Conversions!Q135","v":""},{"$f":"IFERROR(INDEX(C$2:C$295,SMALL(IF(B$2:B$295=\"In\",ROW(C$2:C$295)-ROW(C$2)+1),ROW(C69))),\"\")","v":""}]
[null,{"$f":"IF(Conversions!P136=TRUE,\"In\",\"Out\")","v":"Out"},{"$f":"Conversions!Q136","v":""},{"$f":"IFERROR(INDEX(C$2:C$295,SMALL(IF(B$2:B$295=\"In\",ROW(C$2:C$295)-ROW(C$2)+1),ROW(C70))),\"\")","v":""}]
[null,{"$f":"IF(Conversions!P137=TRUE,\"In\",\"Out\")","v":"Out"},{"$f":"Conversions!Q137","v":""},{"$f":"IFERROR(INDEX(C$2:C$295,SMALL(IF(B$2:B$295=\"In\",ROW(C$2:C$295)-ROW(C$2)+1),ROW(C71))),\"\")","v":""}]
[null,{"$f":"IF(Conversions!P138=TRUE,\"In\",\"Out\")","v":"Out"},{"$f":"Conversions!Q138","v":""},{"$f":"IFERROR(INDEX(C$2:C$295,SMALL(IF(B$2:B$295=\"In\",ROW(C$2:C$295)-ROW(C$2)+1),ROW(C72))),\"\")","v":""}]
[null,{"$f":"IF(Conversions!P139=TRUE,\"In\",\"Out\")","v":"Out"},{"$f":"Conversions!Q139","v":""},{"$f":"IFERROR(INDEX(C$2:C$295,SMALL(IF(B$2:B$295=\"In\",ROW(C$2:C$295)-ROW(C$2)+1),ROW(C73))),\"\")","v":""}]
[null,{"$f":"IF(Conversions!P144=TRUE,\"In\",\"Out\")","v":"Out"},{"$f":"Conversions!Q144","v":""},{"$f":"IFERROR(INDEX(C$2:C$295,SMALL(IF(B$2:B$295=\"In\",ROW(C$2:C$295)-ROW(C$2)+1),ROW(C74))),\"\")","v":""}]
[null,{"$f":"IF(Conversions!P145=TRUE,\"In\",\"Out\")","v":"Out"},{"$f":"Conversions!Q145","v":""},{"$f":"IFERROR(INDEX(C$2:C$295,SMALL(IF(B$2:B$295=\"In\",ROW(C$2:C$295)-ROW(C$2)+1),ROW(C75))),\"\")","v":""}]
[null,{"$f":"IF(Conversions!P146=TRUE,\"In\",\"Out\")","v":"Out"},{"$f":"Conversions!Q146","v":""},{"$f":"IFERROR(INDEX(C$2:C$295,SMALL(IF(B$2:B$295=\"In\",ROW(C$2:C$295)-ROW(C$2)+1),ROW(C76))),\"\")","v":""}]
[null,{"$f":"IF(Conversions!P147=TRUE,\"In\",\"Out\")","v":"Out"},{"$f":"Conversions!Q147","v":""},{"$f":"IFERROR(INDEX(C$2:C$295,SMALL(IF(B$2:B$295=\"In\",ROW(C$2:C$295)-ROW(C$2)+1),ROW(C77))),\"\")","v":""}]
[null,{"$f":"IF(Conversions!P148=TRUE,\"In\",\"Out\")","v":"Out"},{"$f":"Conversions!Q148","v":""},{"$f":"IFERROR(INDEX(C$2:C$295,SMALL(IF(B$2:B$295=\"In\",ROW(C$2:C$295)-ROW(C$2)+1),ROW(C78))),\"\")","v":""}]
[null,{"$f":"IF(Conversions!P149=TRUE,\"In\",\"Out\")","v":"Out"},{"$f":"Conversions!Q149","v":""},{"$f":"IFERROR(INDEX(C$2:C$295,SMALL(IF(B$2:B$295=\"In\",ROW(C$2:C$295)-ROW(C$2)+1),ROW(C79))),\"\")","v":""}]
[null,{"$f":"IF(Conversions!P150=TRUE,\"In\",\"Out\")","v":"Out"},{"$f":"Conversions!Q150","v":""},{"$f":"IFERROR(INDEX(C$2:C$295,SMALL(IF(B$2:B$295=\"In\",ROW(C$2:C$295)-ROW(C$2)+1),ROW(C80))),\"\")","v":""}]
[null,{"$f":"IF(Conversions!P151=TRUE,\"In\",\"Out\")","v":"Out"},{"$f":"Conversions!Q151","v":""},{"$f":"IFERROR(INDEX(C$2:C$295,SMALL(IF(B$2:B$295=\"In\",ROW(C$2:C$295)-ROW(C$2)+1),ROW(C81))),\"\")","v":""}]
[null,{"$f":"IF(Conversions!P152=TRUE,\"In\",\"Out\")","v":"Out"},{"$f":"Conversions!Q152","v":""},{"$f":"IFERROR(INDEX(C$2:C$295,SMALL(IF(B$2:B$295=\"In\",ROW(C$2:C$295)-ROW(C$2)+1),ROW(C82))),\"\")","v":""}]
[null,{"$f":"IF(Conversions!P157=TRUE,\"In\",\"Out\")","v":"Out"},{"$f":"Conversions!Q157","v":""},{"$f":"IFERROR(INDEX(C$2:C$295,SMALL(IF(B$2:B$295=\"In\",ROW(C$2:C$295)-ROW(C$2)+1),ROW(C83))),\"\")","v":""}]
[null,{"$f":"IF(Conversions!P158=TRUE,\"In\",\"Out\")","v":"Out"},{"$f":"Conversions!Q158","v":""},{"$f":"IFERROR(INDEX(C$2:C$295,SMALL(IF(B$2:B$295=\"In\",ROW(C$2:C$295)-ROW(C$2)+1),ROW(C84))),\"\")","v":""}]
[null,{"$f":"IF(Conversions!P159=TRUE,\"In\",\"Out\")","v":"Out"},{"$f":"Conversions!Q159","v":""},{"$f":"IFERROR(INDEX(C$2:C$295,SMALL(IF(B$2:B$295=\"In\",ROW(C$2:C$295)-ROW(C$2)+1),ROW(C85))),\"\")","v":""}]
[null,{"$f":"IF(Conversions!P160=TRUE,\"In\",\"Out\")","v":"Out"},{"$f":"Conversions!Q160","v":""},{"$f":"IFERROR(INDEX(C$2:C$295,SMALL(IF(B$2:B$295=\"In\",ROW(C$2:C$295)-ROW(C$2)+1),ROW(C86))),\"\")","v":""}]
[null,{"$f":"IF(Conversions!P167=TRUE,\"In\",\"Out\")","v":"Out"},{"$f":"Conversions!Q167","v":""},{"$f":"IFERROR(INDEX(C$2:C$295,SMALL(IF(B$2:B$295=\"In\",ROW(C$2:C$295)-ROW(C$2)+1),ROW(C87))),\"\")","v":""}]
[null,{"$f":"IF(Conversions!P168=TRUE,\"In\",\"Out\")","v":"Out"},{"$f":"Conversions!Q168","v":""},{"$f":"IFERROR(INDEX(C$2:C$295,SMALL(IF(B$2:B$295=\"In\",ROW(C$2:C$295)-ROW(C$2)+1),ROW(C88))),\"\")","v":""}]
[null,{"$f":"IF(Conversions!P169=TRUE,\"In\",\"Out\")","v":"Out"},{"$f":"Conversions!Q169","v":""},{"$f":"IFERROR(INDEX(C$2:C$295,SMALL(IF(B$2:B$295=\"In\",ROW(C$2:C$295)-ROW(C$2)+1),ROW(C89))),\"\")","v":""}]
[null,{"$f":"IF(Conversions!P170=TRUE,\"In\",\"Out\")","v":"Out"},{"$f":"Conversions!Q170","v":""},{"$f":"IFERROR(INDEX(C$2:C$295,SMALL(IF(B$2:B$295=\"In\",ROW(C$2:C$295)-ROW(C$2)+1),ROW(C90))),\"\")","v":""}]
[null,{"$f":"IF(Conversions!P171=TRUE,\"In\",\"Out\")","v":"Out"},{"$f":"Conversions!Q171","v":""},{"$f":"IFERROR(INDEX(C$2:C$295,SMALL(IF(B$2:B$295=\"In\",ROW(C$2:C$295)-ROW(C$2)+1),ROW(C91))),\"\")","v":""}]
[null,{"$f":"IF(Conversions!P172=TRUE,\"In\",\"Out\")","v":"Out"},{"$f":"Conversions!Q172","v":""},{"$f":"IFERROR(INDEX(C$2:C$295,SMALL(IF(B$2:B$295=\"In\",ROW(C$2:C$295)-ROW(C$2)+1),ROW(C92))),\"\")","v":""}]
[null,{"$f":"IF(Conversions!P173=TRUE,\"In\",\"Out\")","v":"Out"},{"$f":"Conversions!Q173","v":""},{"$f":"IFERROR(INDEX(C$2:C$295,SMALL(IF(B$2:B$295=\"In\",ROW(C$2:C$295)-ROW(C$2)+1),ROW(C93))),\"\")","v":""}]
[null,{"$f":"IF(Conversions!P174=TRUE,\"In\",\"Out\")","v":"Out"},{"$f":"Conversions!Q174","v":""},{"$f":"IFERROR(INDEX(C$2:C$295,SMALL(IF(B$2:B$295=\"In\",ROW(C$2:C$295)-ROW(C$2)+1),ROW(C94))),\"\")","v":""}]
[null,{"$f":"IF(Conversions!P175=TRUE,\"In\",\"Out\")","v":"Out"},{"$f":"Conversions!Q175","v":""},{"$f":"IFERROR(INDEX(C$2:C$295,SMALL(IF(B$2:B$295=\"In\",ROW(C$2:C$295)-ROW(C$2)+1),ROW(C95))),\"\")","v":""}]
[null,{"$f":"IF(Conversions!P176=TRUE,\"In\",\"Out\")","v":"Out"},{"$f":"Conversions!Q176","v":""},{"$f":"IFERROR(INDEX(C$2:C$295,SMALL(IF(B$2:B$295=\"In\",ROW(C$2:C$295)-ROW(C$2)+1),ROW(C96))),\"\")","v":""}]
[null,{"$f":"IF(Conversions!P177=TRUE,\"In\",\"Out\")","v":"Out"},{"$f":"Conversions!Q177","v":""},{"$f":"IFERROR(INDEX(C$2:C$295,SMALL(IF(B$2:B$295=\"In\",ROW(C$2:C$295)-ROW(C$2)+1),ROW(C97))),\"\")","v":""}]
[null,{"$f":"IF(Conversions!P178=TRUE,\"In\",\"Out\")","v":"Out"},{"$f":"Conversions!Q178","v":""},{"$f":"IFERROR(INDEX(C$2:C$295,SMALL(IF(B$2:B$295=\"In\",ROW(C$2:C$295)-ROW(C$2)+1),ROW(C98))),\"\")","v":""}]
[null,{"$f":"IF(Conversions!P179=TRUE,\"In\",\"Out\")","v":"Out"},{"$f":"Conversions!Q179","v":""},{"$f":"IFERROR(INDEX(C$2:C$295,SMALL(IF(B$2:B$295=\"In\",ROW(C$2:C$295)-ROW(C$2)+1),ROW(C99))),\"\")","v":""}]
[null,{"$f":"IF(Conversions!P180=TRUE,\"In\",\"Out\")","v":"Out"},{"$f":"Conversions!Q180","v":""},{"$f":"IFERROR(INDEX(C$2:C$295,SMALL(IF(B$2:B$295=\"In\",ROW(C$2:C$295)-ROW(C$2)+1),ROW(C100))),\"\")","v":""}]
[null,{"$f":"IF(Conversions!P181=TRUE,\"In\",\"Out\")","v":"Out"},{"$f":"Conversions!Q181","v":""},{"$f":"IFERROR(INDEX(C$2:C$295,SMALL(IF(B$2:B$295=\"In\",ROW(C$2:C$295)-ROW(C$2)+1),ROW(C101))),\"\")","v":""}]
[null,{"$f":"IF(Conversions!P182=TRUE,\"In\",\"Out\")","v":"Out"},{"$f":"Conversions!Q182","v":""},{"$f":"IFERROR(INDEX(C$2:C$295,SMALL(IF(B$2:B$295=\"In\",ROW(C$2:C$295)-ROW(C$2)+1),ROW(C102))),\"\")","v":""}]
[null,{"$f":"IF(Conversions!P183=TRUE,\"In\",\"Out\")","v":"Out"},{"$f":"Conversions!Q183","v":""},{"$f":"IFERROR(INDEX(C$2:C$295,SMALL(IF(B$2:B$295=\"In\",ROW(C$2:C$295)-ROW(C$2)+1),ROW(C103))),\"\")","v":""}]
[null,{"$f":"IF(Conversions!P184=TRUE,\"In\",\"Out\")","v":"Out"},{"$f":"Conversions!Q184","v":""},{"$f":"IFERROR(INDEX(C$2:C$295,SMALL(IF(B$2:B$295=\"In\",ROW(C$2:C$295)-ROW(C$2)+1),ROW(C104))),\"\")","v":""}]
[null,{"$f":"IF(Conversions!P185=TRUE,\"In\",\"Out\")","v":"Out"},{"$f":"Conversions!Q185","v":""},{"$f":"IFERROR(INDEX(C$2:C$295,SMALL(IF(B$2:B$295=\"In\",ROW(C$2:C$295)-ROW(C$2)+1),ROW(C105))),\"\")","v":""}]
[null,{"$f":"IF(Conversions!P186=TRUE,\"In\",\"Out\")","v":"Out"},{"$f":"Conversions!Q186","v":""},{"$f":"IFERROR(INDEX(C$2:C$295,SMALL(IF(B$2:B$295=\"In\",ROW(C$2:C$295)-ROW(C$2)+1),ROW(C106))),\"\")","v":""}]
[null,{"$f":"IF(Conversions!P187=TRUE,\"In\",\"Out\")","v":"Out"},{"$f":"Conversions!Q187","v":""},{"$f":"IFERROR(INDEX(C$2:C$295,SMALL(IF(B$2:B$295=\"In\",ROW(C$2:C$295)-ROW(C$2)+1),ROW(C107))),\"\")","v":""}]
[null,{"$f":"IF(Conversions!P188=TRUE,\"In\",\"Out\")","v":"Out"},{"$f":"Conversions!Q188","v":""},{"$f":"IFERROR(INDEX(C$2:C$295,SMALL(IF(B$2:B$295=\"In\",ROW(C$2:C$295)-ROW(C$2)+1),ROW(C108))),\"\")","v":""}]
[null,{"$f":"IF(Conversions!P189=TRUE,\"In\",\"Out\")","v":"Out"},{"$f":"Conversions!Q189","v":""},{"$f":"IFERROR(INDEX(C$2:C$295,SMALL(IF(B$2:B$295=\"In\",ROW(C$2:C$295)-ROW(C$2)+1),ROW(C109))),\"\")","v":""}]
[null,{"$f":"IF(Conversions!P190=TRUE,\"In\",\"Out\")","v":"Out"},{"$f":"Conversions!Q190","v":""},{"$f":"IFERROR(INDEX(C$2:C$295,SMALL(IF(B$2:B$295=\"In\",ROW(C$2:C$295)-ROW(C$2)+1),ROW(C110))),\"\")","v":""}]
[null,{"$f":"IF(Conversions!P191=TRUE,\"In\",\"Out\")","v":"Out"},{"$f":"Conversions!Q191","v":""},{"$f":"IFERROR(INDEX(C$2:C$295,SMALL(IF(B$2:B$295=\"In\",ROW(C$2:C$295)-ROW(C$2)+1),ROW(C111))),\"\")","v":""}]
[null,{"$f":"IF(Conversions!P192=TRUE,\"In\",\"Out\")","v":"Out"},{"$f":"Conversions!Q192","v":""},{"$f":"IFERROR(INDEX(C$2:C$295,SMALL(IF(B$2:B$295=\"In\",ROW(C$2:C$295)-ROW(C$2)+1),ROW(C112))),\"\")","v":""}]
[null,{"$f":"IF(Conversions!P193=TRUE,\"In\",\"Out\")","v":"Out"},{"$f":"Conversions!Q193","v":""},{"$f":"IFERROR(INDEX(C$2:C$295,SMALL(IF(B$2:B$295=\"In\",ROW(C$2:C$295)-ROW(C$2)+1),ROW(C113))),\"\")","v":""}]
[null,{"$f":"IF(Conversions!P194=TRUE,\"In\",\"Out\")","v":"Out"},{"$f":"Conversions!Q194","v":""},{"$f":"IFERROR(INDEX(C$2:C$295,SMALL(IF(B$2:B$295=\"In\",ROW(C$2:C$295)-ROW(C$2)+1),ROW(C114))),\"\")","v":""}]
[null,{"$f":"IF(Conversions!P195=TRUE,\"In\",\"Out\")","v":"Out"},{"$f":"Conversions!Q195","v":""},{"$f":"IFERROR(INDEX(C$2:C$295,SMALL(IF(B$2:B$295=\"In\",ROW(C$2:C$295)-ROW(C$2)+1),ROW(C115))),\"\")","v":""}]
[null,{"$f":"IF(Conversions!P196=TRUE,\"In\",\"Out\")","v":"Out"},{"$f":"Conversions!Q196","v":""},{"$f":"IFERROR(INDEX(C$2:C$295,SMALL(IF(B$2:B$295=\"In\",ROW(C$2:C$295)-ROW(C$2)+1),ROW(C116))),\"\")","v":""}]
[null,{"$f":"IF(Conversions!P197=TRUE,\"In\",\"Out\")","v":"Out"},{"$f":"Conversions!Q197","v":""},{"$f":"IFERROR(INDEX(C$2:C$295,SMALL(IF(B$2:B$295=\"In\",ROW(C$2:C$295)-ROW(C$2)+1),ROW(C117))),\"\")","v":""}]
[null,{"$f":"IF(Conversions!P198=TRUE,\"In\",\"Out\")","v":"Out"},{"$f":"Conversions!Q198","v":""},{"$f":"IFERROR(INDEX(C$2:C$295,SMALL(IF(B$2:B$295=\"In\",ROW(C$2:C$295)-ROW(C$2)+1),ROW(C118))),\"\")","v":""}]
[null,{"$f":"IF(Conversions!P199=TRUE,\"In\",\"Out\")","v":"Out"},{"$f":"Conversions!Q199","v":""},{"$f":"IFERROR(INDEX(C$2:C$295,SMALL(IF(B$2:B$295=\"In\",ROW(C$2:C$295)-ROW(C$2)+1),ROW(C119))),\"\")","v":""}]
[null,{"$f":"IF(Conversions!P200=TRUE,\"In\",\"Out\")","v":"Out"},{"$f":"Conversions!Q200","v":""},{"$f":"IFERROR(INDEX(C$2:C$295,SMALL(IF(B$2:B$295=\"In\",ROW(C$2:C$295)-ROW(C$2)+1),ROW(C120))),\"\")","v":""}]
[null,{"$f":"IF(Conversions!P201=TRUE,\"In\",\"Out\")","v":"Out"},{"$f":"Conversions!Q201","v":""},{"$f":"IFERROR(INDEX(C$2:C$295,SMALL(IF(B$2:B$295=\"In\",ROW(C$2:C$295)-ROW(C$2)+1),ROW(C121))),\"\")","v":""}]
[null,{"$f":"IF(Conversions!P202=TRUE,\"In\",\"Out\")","v":"Out"},{"$f":"Conversions!Q202","v":""},{"$f":"IFERROR(INDEX(C$2:C$295,SMALL(IF(B$2:B$295=\"In\",ROW(C$2:C$295)-ROW(C$2)+1),ROW(C122))),\"\")","v":""}]
[null,{"$f":"IF(Conversions!P203=TRUE,\"In\",\"Out\")","v":"Out"},{"$f":"Conversions!Q203","v":""},{"$f":"IFERROR(INDEX(C$2:C$295,SMALL(IF(B$2:B$295=\"In\",ROW(C$2:C$295)-ROW(C$2)+1),ROW(C123))),\"\")","v":""}]
[null,{"$f":"IF(Conversions!P204=TRUE,\"In\",\"Out\")","v":"Out"},{"$f":"Conversions!Q204","v":""},{"$f":"IFERROR(INDEX(C$2:C$295,SMALL(IF(B$2:B$295=\"In\",ROW(C$2:C$295)-ROW(C$2)+1),ROW(C124))),\"\")","v":""}]
[null,{"$f":"IF(Conversions!P205=TRUE,\"In\",\"Out\")","v":"Out"},{"$f":"Conversions!Q205","v":""},{"$f":"IFERROR(INDEX(C$2:C$295,SMALL(IF(B$2:B$295=\"In\",ROW(C$2:C$295)-ROW(C$2)+1),ROW(C125))),\"\")","v":""}]
[null,{"$f":"IF(Conversions!P206=TRUE,\"In\",\"Out\")","v":"Out"},{"$f":"Conversions!Q206","v":""},{"$f":"IFERROR(INDEX(C$2:C$295,SMALL(IF(B$2:B$295=\"In\",ROW(C$2:C$295)-ROW(C$2)+1),ROW(C126))),\"\")","v":""}]
[null,{"$f":"IF(Conversions!P207=TRUE,\"In\",\"Out\")","v":"Out"},{"$f":"Conversions!Q207","v":""},{"$f":"IFERROR(INDEX(C$2:C$295,SMALL(IF(B$2:B$295=\"In\",ROW(C$2:C$295)-ROW(C$2)+1),ROW(C127))),\"\")","v":""}]
[null,{"$f":"IF(Conversions!P208=TRUE,\"In\",\"Out\")","v":"Out"},{"$f":"Conversions!Q208","v":""},{"$f":"IFERROR(INDEX(C$2:C$295,SMALL(IF(B$2:B$295=\"In\",ROW(C$2:C$295)-ROW(C$2)+1),ROW(C128))),\"\")","v":""}]
[null,{"$f":"IF(Conversions!P209=TRUE,\"In\",\"Out\")","v":"Out"},{"$f":"Conversions!Q209","v":""},{"$f":"IFERROR(INDEX(C$2:C$295,SMALL(IF(B$2:B$295=\"In\",ROW(C$2:C$295)-ROW(C$2)+1),ROW(C129))),\"\")","v":""}]
[null,{"$f":"IF(Conversions!P210=TRUE,\"In\",\"Out\")","v":"Out"},{"$f":"Conversions!Q210","v":""},{"$f":"IFERROR(INDEX(C$2:C$295,SMALL(IF(B$2:B$295=\"In\",ROW(C$2:C$295)-ROW(C$2)+1),ROW(C130))),\"\")","v":""}]
[null,{"$f":"IF(Conversions!P211=TRUE,\"In\",\"Out\")","v":"Out"},{"$f":"Conversions!Q211","v":""},{"$f":"IFERROR(INDEX(C$2:C$295,SMALL(IF(B$2:B$295=\"In\",ROW(C$2:C$295)-ROW(C$2)+1),ROW(C131))),\"\")","v":""}]
[null,{"$f":"IF(Conversions!P212=TRUE,\"In\",\"Out\")","v":"Out"},{"$f":"Conversions!Q212","v":""},{"$f":"IFERROR(INDEX(C$2:C$295,SMALL(IF(B$2:B$295=\"In\",ROW(C$2:C$295)-ROW(C$2)+1),ROW(C132))),\"\")","v":""}]
[null,{"$f":"IF(Conversions!P213=TRUE,\"In\",\"Out\")","v":"Out"},{"$f":"Conversions!Q213","v":""},{"$f":"IFERROR(INDEX(C$2:C$295,SMALL(IF(B$2:B$295=\"In\",ROW(C$2:C$295)-ROW(C$2)+1),ROW(C133))),\"\")","v":""}]
[null,{"$f":"IF(Conversions!P214=TRUE,\"In\",\"Out\")","v":"Out"},{"$f":"Conversions!Q214","v":""},{"$f":"IFERROR(INDEX(C$2:C$295,SMALL(IF(B$2:B$295=\"In\",ROW(C$2:C$295)-ROW(C$2)+1),ROW(C134))),\"\")","v":""}]
[null,{"$f":"IF(Conversions!P215=TRUE,\"In\",\"Out\")","v":"Out"},{"$f":"Conversions!Q215","v":""},{"$f":"IFERROR(INDEX(C$2:C$295,SMALL(IF(B$2:B$295=\"In\",ROW(C$2:C$295)-ROW(C$2)+1),ROW(C135))),\"\")","v":""}]
[null,{"$f":"IF(Conversions!P216=TRUE,\"In\",\"Out\")","v":"Out"},{"$f":"Conversions!Q216","v":""},{"$f":"IFERROR(INDEX(C$2:C$295,SMALL(IF(B$2:B$295=\"In\",ROW(C$2:C$295)-ROW(C$2)+1),ROW(C136))),\"\")","v":""}]
[null,{"$f":"IF(Conversions!P217=TRUE,\"In\",\"Out\")","v":"Out"},{"$f":"Conversions!Q217","v":""},{"$f":"IFERROR(INDEX(C$2:C$295,SMALL(IF(B$2:B$295=\"In\",ROW(C$2:C$295)-ROW(C$2)+1),ROW(C137))),\"\")","v":""}]
[null,{"$f":"IF(Conversions!P218=TRUE,\"In\",\"Out\")","v":"Out"},{"$f":"Conversions!Q218","v":""},{"$f":"IFERROR(INDEX(C$2:C$295,SMALL(IF(B$2:B$295=\"In\",ROW(C$2:C$295)-ROW(C$2)+1),ROW(C138))),\"\")","v":""}]
[null,{"$f":"IF(Conversions!P219=TRUE,\"In\",\"Out\")","v":"Out"},{"$f":"Conversions!Q219","v":""},{"$f":"IFERROR(INDEX(C$2:C$295,SMALL(IF(B$2:B$295=\"In\",ROW(C$2:C$295)-ROW(C$2)+1),ROW(C139))),\"\")","v":""}]
[null,{"$f":"IF(Conversions!P220=TRUE,\"In\",\"Out\")","v":"Out"},{"$f":"Conversions!Q220","v":""},{"$f":"IFERROR(INDEX(C$2:C$295,SMALL(IF(B$2:B$295=\"In\",ROW(C$2:C$295)-ROW(C$2)+1),ROW(C140))),\"\")","v":""}]
[null,{"$f":"IF(Conversions!P221=TRUE,\"In\",\"Out\")","v":"Out"},{"$f":"Conversions!Q221","v":""},{"$f":"IFERROR(INDEX(C$2:C$295,SMALL(IF(B$2:B$295=\"In\",ROW(C$2:C$295)-ROW(C$2)+1),ROW(C141))),\"\")","v":""}]
[null,{"$f":"IF(Conversions!P222=TRUE,\"In\",\"Out\")","v":"Out"},{"$f":"Conversions!Q222","v":""},{"$f":"IFERROR(INDEX(C$2:C$295,SMALL(IF(B$2:B$295=\"In\",ROW(C$2:C$295)-ROW(C$2)+1),ROW(C142))),\"\")","v":""}]
[null,{"$f":"IF(Conversions!P223=TRUE,\"In\",\"Out\")","v":"Out"},{"$f":"Conversions!Q223","v":""},{"$f":"IFERROR(INDEX(C$2:C$295,SMALL(IF(B$2:B$295=\"In\",ROW(C$2:C$295)-ROW(C$2)+1),ROW(C143))),\"\")","v":""}]
[null,{"$f":"IF(Conversions!P224=TRUE,\"In\",\"Out\")","v":"Out"},{"$f":"Conversions!Q224","v":""},{"$f":"IFERROR(INDEX(C$2:C$295,SMALL(IF(B$2:B$295=\"In\",ROW(C$2:C$295)-ROW(C$2)+1),ROW(C144))),\"\")","v":""}]
[null,{"$f":"IF(Conversions!P225=TRUE,\"In\",\"Out\")","v":"Out"},{"$f":"Conversions!Q225","v":""},{"$f":"IFERROR(INDEX(C$2:C$295,SMALL(IF(B$2:B$295=\"In\",ROW(C$2:C$295)-ROW(C$2)+1),ROW(C145))),\"\")","v":""}]
[null,{"$f":"IF(Conversions!P226=TRUE,\"In\",\"Out\")","v":"Out"},{"$f":"Conversions!Q226","v":""},{"$f":"IFERROR(INDEX(C$2:C$295,SMALL(IF(B$2:B$295=\"In\",ROW(C$2:C$295)-ROW(C$2)+1),ROW(C146))),\"\")","v":""}]
[null,{"$f":"IF(Conversions!P227=TRUE,\"In\",\"Out\")","v":"Out"},{"$f":"Conversions!Q227","v":""},{"$f":"IFERROR(INDEX(C$2:C$295,SMALL(IF(B$2:B$295=\"In\",ROW(C$2:C$295)-ROW(C$2)+1),ROW(C147))),\"\")","v":""}]
[null,{"$f":"IF(Conversions!P228=TRUE,\"In\",\"Out\")","v":"Out"},{"$f":"Conversions!Q228","v":""},{"$f":"IFERROR(INDEX(C$2:C$295,SMALL(IF(B$2:B$295=\"In\",ROW(C$2:C$295)-ROW(C$2)+1),ROW(C148))),\"\")","v":""}]
[null,{"$f":"IF(Conversions!P229=TRUE,\"In\",\"Out\")","v":"Out"},{"$f":"Conversions!Q229","v":""},{"$f":"IFERROR(INDEX(C$2:C$295,SMALL(IF(B$2:B$295=\"In\",ROW(C$2:C$295)-ROW(C$2)+1),ROW(C149))),\"\")","v":""}]
[null,{"$f":"IF(Conversions!P230=TRUE,\"In\",\"Out\")","v":"Out"},{"$f":"Conversions!Q230","v":""},{"$f":"IFERROR(INDEX(C$2:C$295,SMALL(IF(B$2:B$295=\"In\",ROW(C$2:C$295)-ROW(C$2)+1),ROW(C150))),\"\")","v":""}]
[null,{"$f":"IF(Conversions!P231=TRUE,\"In\",\"Out\")","v":"Out"},{"$f":"Conversions!Q231","v":""},{"$f":"IFERROR(INDEX(C$2:C$295,SMALL(IF(B$2:B$295=\"In\",ROW(C$2:C$295)-ROW(C$2)+1),ROW(C151))),\"\")","v":""}]
[null,{"$f":"IF(Conversions!P232=TRUE,\"In\",\"Out\")","v":"Out"},{"$f":"Conversions!Q232","v":""},{"$f":"IFERROR(INDEX(C$2:C$295,SMALL(IF(B$2:B$295=\"In\",ROW(C$2:C$295)-ROW(C$2)+1),ROW(C152))),\"\")","v":""}]
[null,{"$f":"IF(Conversions!P233=TRUE,\"In\",\"Out\")","v":"Out"},{"$f":"Conversions!Q233","v":""},{"$f":"IFERROR(INDEX(C$2:C$295,SMALL(IF(B$2:B$295=\"In\",ROW(C$2:C$295)-ROW(C$2)+1),ROW(C153))),\"\")","v":""}]
[null,{"$f":"IF(Conversions!P234=TRUE,\"In\",\"Out\")","v":"Out"},{"$f":"Conversions!Q234","v":""},{"$f":"IFERROR(INDEX(C$2:C$295,SMALL(IF(B$2:B$295=\"In\",ROW(C$2:C$295)-ROW(C$2)+1),ROW(C154))),\"\")","v":""}]
[null,{"$f":"IF(Conversions!P235=TRUE,\"In\",\"Out\")","v":"Out"},{"$f":"Conversions!Q235","v":""},{"$f":"IFERROR(INDEX(C$2:C$295,SMALL(IF(B$2:B$295=\"In\",ROW(C$2:C$295)-ROW(C$2)+1),ROW(C155))),\"\")","v":""}]
[null,{"$f":"IF(Conversions!P236=TRUE,\"In\",\"Out\")","v":"Out"},{"$f":"Conversions!Q236","v":""},{"$f":"IFERROR(INDEX(C$2:C$295,SMALL(IF(B$2:B$295=\"In\",ROW(C$2:C$295)-ROW(C$2)+1),ROW(C156))),\"\")","v":""}]
[null,{"$f":"IF(Conversions!P237=TRUE,\"In\",\"Out\")","v":"Out"},{"$f":"Conversions!Q237","v":""},{"$f":"IFERROR(INDEX(C$2:C$295,SMALL(IF(B$2:B$295=\"In\",ROW(C$2:C$295)-ROW(C$2)+1),ROW(C157))),\"\")","v":""}]
[null,{"$f":"IF(Conversions!P238=TRUE,\"In\",\"Out\")","v":"Out"},{"$f":"Conversions!Q238","v":""},{"$f":"IFERROR(INDEX(C$2:C$295,SMALL(IF(B$2:B$295=\"In\",ROW(C$2:C$295)-ROW(C$2)+1),ROW(C158))),\"\")","v":""}]
[null,{"$f":"IF(Conversions!P239=TRUE,\"In\",\"Out\")","v":"Out"},{"$f":"Conversions!Q239","v":""},{"$f":"IFERROR(INDEX(C$2:C$295,SMALL(IF(B$2:B$295=\"In\",ROW(C$2:C$295)-ROW(C$2)+1),ROW(C159))),\"\")","v":""}]
[null,{"$f":"IF(Conversions!P240=TRUE,\"In\",\"Out\")","v":"Out"},{"$f":"Conversions!Q240","v":""},{"$f":"IFERROR(INDEX(C$2:C$295,SMALL(IF(B$2:B$295=\"In\",ROW(C$2:C$295)-ROW(C$2)+1),ROW(C160))),\"\")","v":""}]
[null,{"$f":"IF(Conversions!P241=TRUE,\"In\",\"Out\")","v":"Out"},{"$f":"Conversions!Q241","v":""},{"$f":"IFERROR(INDEX(C$2:C$295,SMALL(IF(B$2:B$295=\"In\",ROW(C$2:C$295)-ROW(C$2)+1),ROW(C161))),\"\")","v":""}]
[null,{"$f":"IF(Conversions!P242=TRUE,\"In\",\"Out\")","v":"Out"},{"$f":"Conversions!Q242","v":""},{"$f":"IFERROR(INDEX(C$2:C$295,SMALL(IF(B$2:B$295=\"In\",ROW(C$2:C$295)-ROW(C$2)+1),ROW(C162))),\"\")","v":""}]
[null,{"$f":"IF(Conversions!P243=TRUE,\"In\",\"Out\")","v":"Out"},{"$f":"Conversions!Q243","v":""},{"$f":"IFERROR(INDEX(C$2:C$295,SMALL(IF(B$2:B$295=\"In\",ROW(C$2:C$295)-ROW(C$2)+1),ROW(C163))),\"\")","v":""}]
[null,{"$f":"IF(Conversions!P244=TRUE,\"In\",\"Out\")","v":"Out"},{"$f":"Conversions!Q244","v":""},{"$f":"IFERROR(INDEX(C$2:C$295,SMALL(IF(B$2:B$295=\"In\",ROW(C$2:C$295)-ROW(C$2)+1),ROW(C164))),\"\")","v":""}]
[null,{"$f":"IF(Conversions!P245=TRUE,\"In\",\"Out\")","v":"Out"},{"$f":"Conversions!Q245","v":""},{"$f":"IFERROR(INDEX(C$2:C$295,SMALL(IF(B$2:B$295=\"In\",ROW(C$2:C$295)-ROW(C$2)+1),ROW(C165))),\"\")","v":""}]
[null,{"$f":"IF(Conversions!P246=TRUE,\"In\",\"Out\")","v":"Out"},{"$f":"Conversions!Q246","v":""},{"$f":"IFERROR(INDEX(C$2:C$295,SMALL(IF(B$2:B$295=\"In\",ROW(C$2:C$295)-ROW(C$2)+1),ROW(C166))),\"\")","v":""}]
[null,{"$f":"IF(Conversions!P247=TRUE,\"In\",\"Out\")","v":"Out"},{"$f":"Conversions!Q247","v":""},{"$f":"IFERROR(INDEX(C$2:C$295,SMALL(IF(B$2:B$295=\"In\",ROW(C$2:C$295)-ROW(C$2)+1),ROW(C167))),\"\")","v":""}]
[null,{"$f":"IF(Conversions!P248=TRUE,\"In\",\"Out\")","v":"Out"},{"$f":"Conversions!Q248","v":""},{"$f":"IFERROR(INDEX(C$2:C$295,SMALL(IF(B$2:B$295=\"In\",ROW(C$2:C$295)-ROW(C$2)+1),ROW(C168))),\"\")","v":""}]
[null,{"$f":"IF(Conversions!P249=TRUE,\"In\",\"Out\")","v":"Out"},{"$f":"Conversions!Q249","v":""},{"$f":"IFERROR(INDEX(C$2:C$295,SMALL(IF(B$2:B$295=\"In\",ROW(C$2:C$295)-ROW(C$2)+1),ROW(C169))),\"\")","v":""}]
[null,{"$f":"IF(Conversions!P250=TRUE,\"In\",\"Out\")","v":"Out"},{"$f":"Conversions!Q250","v":""},{"$f":"IFERROR(INDEX(C$2:C$295,SMALL(IF(B$2:B$295=\"In\",ROW(C$2:C$295)-ROW(C$2)+1),ROW(C170))),\"\")","v":""}]
[null,{"$f":"IF(Conversions!P251=TRUE,\"In\",\"Out\")","v":"Out"},{"$f":"Conversions!Q251","v":""},{"$f":"IFERROR(INDEX(C$2:C$295,SMALL(IF(B$2:B$295=\"In\",ROW(C$2:C$295)-ROW(C$2)+1),ROW(C171))),\"\")","v":""}]
[null,{"$f":"IF(Conversions!P252=TRUE,\"In\",\"Out\")","v":"Out"},{"$f":"Conversions!Q252","v":""},{"$f":"IFERROR(INDEX(C$2:C$295,SMALL(IF(B$2:B$295=\"In\",ROW(C$2:C$295)-ROW(C$2)+1),ROW(C172))),\"\")","v":""}]
[null,{"$f":"IF(Conversions!P253=TRUE,\"In\",\"Out\")","v":"Out"},{"$f":"Conversions!Q253","v":""},{"$f":"IFERROR(INDEX(C$2:C$295,SMALL(IF(B$2:B$295=\"In\",ROW(C$2:C$295)-ROW(C$2)+1),ROW(C173))),\"\")","v":""}]
[null,{"$f":"IF(Conversions!P254=TRUE,\"In\",\"Out\")","v":"Out"},{"$f":"Conversions!Q254","v":""},{"$f":"IFERROR(INDEX(C$2:C$295,SMALL(IF(B$2:B$295=\"In\",ROW(C$2:C$295)-ROW(C$2)+1),ROW(C174))),\"\")","v":""}]
[null,{"$f":"IF(Conversions!P255=TRUE,\"In\",\"Out\")","v":"Out"},{"$f":"Conversions!Q255","v":""},{"$f":"IFERROR(INDEX(C$2:C$295,SMALL(IF(B$2:B$295=\"In\",ROW(C$2:C$295)-ROW(C$2)+1),ROW(C175))),\"\")","v":""}]
[null,{"$f":"IF(Conversions!P256=TRUE,\"In\",\"Out\")","v":"Out"},{"$f":"Conversions!Q256","v":""},{"$f":"IFERROR(INDEX(C$2:C$295,SMALL(IF(B$2:B$295=\"In\",ROW(C$2:C$295)-ROW(C$2)+1),ROW(C176))),\"\")","v":""}]
[null,{"$f":"IF(Conversions!P257=TRUE,\"In\",\"Out\")","v":"Out"},{"$f":"Conversions!Q257","v":""},{"$f":"IFERROR(INDEX(C$2:C$295,SMALL(IF(B$2:B$295=\"In\",ROW(C$2:C$295)-ROW(C$2)+1),ROW(C177))),\"\")","v":""}]
[null,{"$f":"IF(Conversions!P258=TRUE,\"In\",\"Out\")","v":"Out"},{"$f":"Conversions!Q258","v":""},{"$f":"IFERROR(INDEX(C$2:C$295,SMALL(IF(B$2:B$295=\"In\",ROW(C$2:C$295)-ROW(C$2)+1),ROW(C178))),\"\")","v":""}]
[null,{"$f":"IF(Conversions!P259=TRUE,\"In\",\"Out\")","v":"Out"},{"$f":"Conversions!Q259","v":""},{"$f":"IFERROR(INDEX(C$2:C$295,SMALL(IF(B$2:B$295=\"In\",ROW(C$2:C$295)-ROW(C$2)+1),ROW(C179))),\"\")","v":""}]
[null,{"$f":"IF(Conversions!P260=TRUE,\"In\",\"Out\")","v":"Out"},{"$f":"Conversions!Q260","v":""},{"$f":"IFERROR(INDEX(C$2:C$295,SMALL(IF(B$2:B$295=\"In\",ROW(C$2:C$295)-ROW(C$2)+1),ROW(C180))),\"\")","v":""}]
[null,{"$f":"IF(Conversions!P261=TRUE,\"In\",\"Out\")","v":"Out"},{"$f":"Conversions!Q261","v":""},{"$f":"IFERROR(INDEX(C$2:C$295,SMALL(IF(B$2:B$295=\"In\",ROW(C$2:C$295)-ROW(C$2)+1),ROW(C181))),\"\")","v":""}]
[null,{"$f":"IF(Conversions!P262=TRUE,\"In\",\"Out\")","v":"Out"},{"$f":"Conversions!Q262","v":""},{"$f":"IFERROR(INDEX(C$2:C$295,SMALL(IF(B$2:B$295=\"In\",ROW(C$2:C$295)-ROW(C$2)+1),ROW(C182))),\"\")","v":""}]
[null,{"$f":"IF(Conversions!P268=TRUE,\"In\",\"Out\")","v":"Out"},{"$f":"Conversions!Q268","v":""},{"$f":"IFERROR(INDEX(C$2:C$295,SMALL(IF(B$2:B$295=\"In\",ROW(C$2:C$295)-ROW(C$2)+1),ROW(C183))),\"\")","v":""}]
[null,{"$f":"IF(Conversions!P269=TRUE,\"In\",\"Out\")","v":"Out"},{"$f":"Conversions!Q269","v":""},{"$f":"IFERROR(INDEX(C$2:C$295,SMALL(IF(B$2:B$295=\"In\",ROW(C$2:C$295)-ROW(C$2)+1),ROW(C184))),\"\")","v":""}]
[null,{"$f":"IF(Conversions!P270=TRUE,\"In\",\"Out\")","v":"Out"},{"$f":"Conversions!Q270","v":""},{"$f":"IFERROR(INDEX(C$2:C$295,SMALL(IF(B$2:B$295=\"In\",ROW(C$2:C$295)-ROW(C$2)+1),ROW(C185))),\"\")","v":""}]
[null,{"$f":"IF(Conversions!P271=TRUE,\"In\",\"Out\")","v":"Out"},{"$f":"Conversions!Q271","v":""},{"$f":"IFERROR(INDEX(C$2:C$295,SMALL(IF(B$2:B$295=\"In\",ROW(C$2:C$295)-ROW(C$2)+1),ROW(C186))),\"\")","v":""}]
[null,{"$f":"IF(Conversions!P272=TRUE,\"In\",\"Out\")","v":"Out"},{"$f":"Conversions!Q272","v":""},{"$f":"IFERROR(INDEX(C$2:C$295,SMALL(IF(B$2:B$295=\"In\",ROW(C$2:C$295)-ROW(C$2)+1),ROW(C187))),\"\")","v":""}]
[null,{"$f":"IF(Conversions!P273=TRUE,\"In\",\"Out\")","v":"Out"},{"$f":"Conversions!Q273","v":""},{"$f":"IFERROR(INDEX(C$2:C$295,SMALL(IF(B$2:B$295=\"In\",ROW(C$2:C$295)-ROW(C$2)+1),ROW(C188))),\"\")","v":""}]
[null,{"$f":"IF(Conversions!P274=TRUE,\"In\",\"Out\")","v":"Out"},{"$f":"Conversions!Q274","v":""},{"$f":"IFERROR(INDEX(C$2:C$295,SMALL(IF(B$2:B$295=\"In\",ROW(C$2:C$295)-ROW(C$2)+1),ROW(C189))),\"\")","v":""}]
[null,{"$f":"IF(Conversions!P275=TRUE,\"In\",\"Out\")","v":"Out"},{"$f":"Conversions!Q275","v":""},{"$f":"IFERROR(INDEX(C$2:C$295,SMALL(IF(B$2:B$295=\"In\",ROW(C$2:C$295)-ROW(C$2)+1),ROW(C190))),\"\")","v":""}]
[null,{"$f":"IF(Conversions!P276=TRUE,\"In\",\"Out\")","v":"Out"},{"$f":"Conversions!Q276","v":""},{"$f":"IFERROR(INDEX(C$2:C$295,SMALL(IF(B$2:B$295=\"In\",ROW(C$2:C$295)-ROW(C$2)+1),ROW(C191))),\"\")","v":""}]
[null,{"$f":"IF(Conversions!P277=TRUE,\"In\",\"Out\")","v":"Out"},{"$f":"Conversions!Q277","v":""},{"$f":"IFERROR(INDEX(C$2:C$295,SMALL(IF(B$2:B$295=\"In\",ROW(C$2:C$295)-ROW(C$2)+1),ROW(C192))),\"\")","v":""}]
[null,{"$f":"IF(Conversions!P278=TRUE,\"In\",\"Out\")","v":"Out"},{"$f":"Conversions!Q278","v":""},{"$f":"IFERROR(INDEX(C$2:C$295,SMALL(IF(B$2:B$295=\"In\",ROW(C$2:C$295)-ROW(C$2)+1),ROW(C193))),\"\")","v":""}]
[null,{"$f":"IF(Conversions!P279=TRUE,\"In\",\"Out\")","v":"Out"},{"$f":"Conversions!Q279","v":""},{"$f":"IFERROR(INDEX(C$2:C$295,SMALL(IF(B$2:B$295=\"In\",ROW(C$2:C$295)-ROW(C$2)+1),ROW(C194))),\"\")","v":""}]
[null,{"$f":"IF(Conversions!P280=TRUE,\"In\",\"Out\")","v":"Out"},{"$f":"Conversions!Q280","v":""},{"$f":"IFERROR(INDEX(C$2:C$295,SMALL(IF(B$2:B$295=\"In\",ROW(C$2:C$295)-ROW(C$2)+1),ROW(C195))),\"\")","v":""}]
[null,{"$f":"IF(Conversions!P281=TRUE,\"In\",\"Out\")","v":"Out"},{"$f":"Conversions!Q281","v":""},{"$f":"IFERROR(INDEX(C$2:C$295,SMALL(IF(B$2:B$295=\"In\",ROW(C$2:C$295)-ROW(C$2)+1),ROW(C196))),\"\")","v":""}]
[null,{"$f":"IF(Conversions!P282=TRUE,\"In\",\"Out\")","v":"Out"},{"$f":"Conversions!Q282","v":""},{"$f":"IFERROR(INDEX(C$2:C$295,SMALL(IF(B$2:B$295=\"In\",ROW(C$2:C$295)-ROW(C$2)+1),ROW(C197))),\"\")","v":""}]
[null,{"$f":"IF(Conversions!P283=TRUE,\"In\",\"Out\")","v":"Out"},{"$f":"Conversions!Q283","v":""},{"$f":"IFERROR(INDEX(C$2:C$295,SMALL(IF(B$2:B$295=\"In\",ROW(C$2:C$295)-ROW(C$2)+1),ROW(C198))),\"\")","v":""}]
[null,{"$f":"IF(Conversions!P284=TRUE,\"In\",\"Out\")","v":"Out"},{"$f":"Conversions!Q284","v":""},{"$f":"IFERROR(INDEX(C$2:C$295,SMALL(IF(B$2:B$295=\"In\",ROW(C$2:C$295)-ROW(C$2)+1),ROW(C199))),\"\")","v":""}]
[null,{"$f":"IF(Conversions!P285=TRUE,\"In\",\"Out\")","v":"Out"},{"$f":"Conversions!Q285","v":""},{"$f":"IFERROR(INDEX(C$2:C$295,SMALL(IF(B$2:B$295=\"In\",ROW(C$2:C$295)-ROW(C$2)+1),ROW(C200))),\"\")","v":""}]
[null,{"$f":"IF(Conversions!P286=TRUE,\"In\",\"Out\")","v":"Out"},{"$f":"Conversions!Q286","v":""},{"$f":"IFERROR(INDEX(C$2:C$295,SMALL(IF(B$2:B$295=\"In\",ROW(C$2:C$295)-ROW(C$2)+1),ROW(C201))),\"\")","v":""}]
[null,{"$f":"IF(Conversions!P287=TRUE,\"In\",\"Out\")","v":"Out"},{"$f":"Conversions!Q287","v":""},{"$f":"IFERROR(INDEX(C$2:C$295,SMALL(IF(B$2:B$295=\"In\",ROW(C$2:C$295)-ROW(C$2)+1),ROW(C202))),\"\")","v":""}]
[null,{"$f":"IF(Conversions!P288=TRUE,\"In\",\"Out\")","v":"Out"},{"$f":"Conversions!Q288","v":""},{"$f":"IFERROR(INDEX(C$2:C$295,SMALL(IF(B$2:B$295=\"In\",ROW(C$2:C$295)-ROW(C$2)+1),ROW(C203))),\"\")","v":""}]
[null,{"$f":"IF(Conversions!P289=TRUE,\"In\",\"Out\")","v":"Out"},{"$f":"Conversions!Q289","v":""},{"$f":"IFERROR(INDEX(C$2:C$295,SMALL(IF(B$2:B$295=\"In\",ROW(C$2:C$295)-ROW(C$2)+1),ROW(C204))),\"\")","v":""}]
[null,{"$f":"IF(Conversions!P290=TRUE,\"In\",\"Out\")","v":"Out"},{"$f":"Conversions!Q290","v":""},{"$f":"IFERROR(INDEX(C$2:C$295,SMALL(IF(B$2:B$295=\"In\",ROW(C$2:C$295)-ROW(C$2)+1),ROW(C205))),\"\")","v":""}]
[null,{"$f":"IF(Conversions!P291=TRUE,\"In\",\"Out\")","v":"Out"},{"$f":"Conversions!Q291","v":""},{"$f":"IFERROR(INDEX(C$2:C$295,SMALL(IF(B$2:B$295=\"In\",ROW(C$2:C$295)-ROW(C$2)+1),ROW(C206))),\"\")","v":""}]
[null,{"$f":"IF(Conversions!P292=TRUE,\"In\",\"Out\")","v":"Out"},{"$f":"Conversions!Q292","v":""},{"$f":"IFERROR(INDEX(C$2:C$295,SMALL(IF(B$2:B$295=\"In\",ROW(C$2:C$295)-ROW(C$2)+1),ROW(C207))),\"\")","v":""}]
[null,{"$f":"IF(Conversions!P293=TRUE,\"In\",\"Out\")","v":"Out"},{"$f":"Conversions!Q293","v":""},{"$f":"IFERROR(INDEX(C$2:C$295,SMALL(IF(B$2:B$295=\"In\",ROW(C$2:C$295)-ROW(C$2)+1),ROW(C208))),\"\")","v":""}]
[null,{"$f":"IF(Conversions!P294=TRUE,\"In\",\"Out\")","v":"Out"},{"$f":"Conversions!Q294","v":""},{"$f":"IFERROR(INDEX(C$2:C$295,SMALL(IF(B$2:B$295=\"In\",ROW(C$2:C$295)-ROW(C$2)+1),ROW(C209))),\"\")","v":""}]
[null,{"$f":"IF(Conversions!P295=TRUE,\"In\",\"Out\")","v":"Out"},{"$f":"Conversions!Q295","v":""},{"$f":"IFERROR(INDEX(C$2:C$295,SMALL(IF(B$2:B$295=\"In\",ROW(C$2:C$295)-ROW(C$2)+1),ROW(C210))),\"\")","v":""}]
[null,{"$f":"IF(Conversions!P296=TRUE,\"In\",\"Out\")","v":"Out"},{"$f":"Conversions!Q296","v":""},{"$f":"IFERROR(INDEX(C$2:C$295,SMALL(IF(B$2:B$295=\"In\",ROW(C$2:C$295)-ROW(C$2)+1),ROW(C211))),\"\")","v":""}]
[null,{"$f":"IF(Conversions!P297=TRUE,\"In\",\"Out\")","v":"Out"},{"$f":"Conversions!Q297","v":""},{"$f":"IFERROR(INDEX(C$2:C$295,SMALL(IF(B$2:B$295=\"In\",ROW(C$2:C$295)-ROW(C$2)+1),ROW(C212))),\"\")","v":""}]
[null,{"$f":"IF(Conversions!P298=TRUE,\"In\",\"Out\")","v":"Out"},{"$f":"Conversions!Q298","v":""},{"$f":"IFERROR(INDEX(C$2:C$295,SMALL(IF(B$2:B$295=\"In\",ROW(C$2:C$295)-ROW(C$2)+1),ROW(C213))),\"\")","v":""}]
[null,{"$f":"IF(Conversions!P299=TRUE,\"In\",\"Out\")","v":"Out"},{"$f":"Conversions!Q299","v":""},{"$f":"IFERROR(INDEX(C$2:C$295,SMALL(IF(B$2:B$295=\"In\",ROW(C$2:C$295)-ROW(C$2)+1),ROW(C214))),\"\")","v":""}]
[null,{"$f":"IF(Conversions!P300=TRUE,\"In\",\"Out\")","v":"Out"},{"$f":"Conversions!Q300","v":""},{"$f":"IFERROR(INDEX(C$2:C$295,SMALL(IF(B$2:B$295=\"In\",ROW(C$2:C$295)-ROW(C$2)+1),ROW(C215))),\"\")","v":""}]
[null,{"$f":"IF(Conversions!P301=TRUE,\"In\",\"Out\")","v":"Out"},{"$f":"Conversions!Q301","v":""},{"$f":"IFERROR(INDEX(C$2:C$295,SMALL(IF(B$2:B$295=\"In\",ROW(C$2:C$295)-ROW(C$2)+1),ROW(C216))),\"\")","v":""}]
[null,{"$f":"IF(Conversions!P302=TRUE,\"In\",\"Out\")","v":"Out"},{"$f":"Conversions!Q302","v":""},{"$f":"IFERROR(INDEX(C$2:C$295,SMALL(IF(B$2:B$295=\"In\",ROW(C$2:C$295)-ROW(C$2)+1),ROW(C217))),\"\")","v":""}]
[null,{"$f":"IF(Conversions!P303=TRUE,\"In\",\"Out\")","v":"Out"},{"$f":"Conversions!Q303","v":""},{"$f":"IFERROR(INDEX(C$2:C$295,SMALL(IF(B$2:B$295=\"In\",ROW(C$2:C$295)-ROW(C$2)+1),ROW(C218))),\"\")","v":""}]
[null,{"$f":"IF(Conversions!P304=TRUE,\"In\",\"Out\")","v":"Out"},{"$f":"Conversions!Q304","v":""},{"$f":"IFERROR(INDEX(C$2:C$295,SMALL(IF(B$2:B$295=\"In\",ROW(C$2:C$295)-ROW(C$2)+1),ROW(C219))),\"\")","v":""}]
[null,{"$f":"IF(Conversions!P360=TRUE,\"In\",\"Out\")","v":"Out"},{"$f":"Conversions!Q360","v":""},{"$f":"IFERROR(INDEX(C$2:C$295,SMALL(IF(B$2:B$295=\"In\",ROW(C$2:C$295)-ROW(C$2)+1),ROW(C220))),\"\")","v":""}]
[null,{"$f":"IF(Conversions!P361=TRUE,\"In\",\"Out\")","v":"Out"},{"$f":"Conversions!Q361","v":""},{"$f":"IFERROR(INDEX(C$2:C$295,SMALL(IF(B$2:B$295=\"In\",ROW(C$2:C$295)-ROW(C$2)+1),ROW(C221))),\"\")","v":""}]
[null,{"$f":"IF(Conversions!P362=TRUE,\"In\",\"Out\")","v":"Out"},{"$f":"Conversions!Q362","v":""},{"$f":"IFERROR(INDEX(C$2:C$295,SMALL(IF(B$2:B$295=\"In\",ROW(C$2:C$295)-ROW(C$2)+1),ROW(C222))),\"\")","v":""}]
[null,{"$f":"IF(Conversions!P363=TRUE,\"In\",\"Out\")","v":"Out"},{"$f":"Conversions!Q363","v":""},{"$f":"IFERROR(INDEX(C$2:C$295,SMALL(IF(B$2:B$295=\"In\",ROW(C$2:C$295)-ROW(C$2)+1),ROW(C223))),\"\")","v":""}]
[null,null,null,{"$f":"IFERROR(INDEX(C$2:C$295,SMALL(IF(B$2:B$295=\"In\",ROW(C$2:C$295)-ROW(C$2)+1),ROW(C224))),\"\")","v":""}]
[null,null,null,{"$f":"IFERROR(INDEX(C$2:C$295,SMALL(IF(B$2:B$295=\"In\",ROW(C$2:C$295)-ROW(C$2)+1),ROW(C225))),\"\")","v":""}]
[]
[null,null,null,"Add Additional Notes here (if Required):"]
[]
[]
[]
[]
[]
[]
[]
[]
[]
[]
[]
[]
[]
[null,null,null,"This financial statement is an accurate record of the information provided."]
[]
[]
[null,null,null,"Signed:                                                                                               Date:"]

{"sheet":"Notes","index":9,"n_rows":369,"n_cols":5,"rows_kept":369,"cut":false,"hidden":false,"merged":[[7,4,12,4]]}
[]
[null,{"$f":"IF(Conversions!P9=TRUE,\"In\",\"Out\")","v":"Out"},{"$f":"Conversions!S9","v":""},null,"Additional notes (e.g. Reasons for debt, circumstances, temporary situations)\nPLEASE NOTE: previous comments will be shown here, please add further notes at the bottom - click show continuation sheet for all notes."]
[null,{"$f":"IF(Conversions!P10=TRUE,\"In\",\"Out\")","v":"Out"},{"$f":"Conversions!S10","v":""}]
[null,{"$f":"IF(Conversions!P11=TRUE,\"In\",\"Out\")","v":"Out"},{"$f":"Conversions!S11","v":""},null,{"$f":"500 - (LEN(E8))","v":500}]
[null,{"$f":"IF(Conversions!P12=TRUE,\"In\",\"Out\")","v":"Out"},{"$f":"Conversions!S12","v":""},null,"Characters Remaining"]
[null,{"$f":"IF(Conversions!P13=TRUE,\"In\",\"Out\")","v":"Out"},{"$f":"Conversions!S13","v":"\""}]
[null,{"$f":"IF(Conversions!P14=TRUE,\"In\",\"Out\")","v":"Out"},{"$f":"Conversions!S14","v":0},null,"Reasons for debt, client circumstances or vulnerabilities, temporary situations, detail regarding benefits or repayment terms:"]
[null,{"$f":"IF(Conversions!P15=TRUE,\"In\",\"Out\")","v":"Out"},{"$f":"Conversions!S15","v":0}]
[null,{"$f":"IF(Conversions!P16=TRUE,\"In\",\"Out\")","v":"Out"},{"$f":"Conversions!S16","v":""}]
[null,{"$f":"IF(Conversions!P17=TRUE,\"In\",\"Out\")","v":"Out"},{"$f":"Conversions!S17","v":""}]
[null,{"$f":"IF(Conversions!P18=TRUE,\"In\",\"Out\")","v":"Out"},{"$f":"Conversions!S18","v":""}]
[null,{"$f":"IF(Conversions!P19=TRUE,\"In\",\"Out\")","v":"Out"},{"$f":"Conversions!S19","v":""}]
[null,{"$f":"IF(Conversions!P20=TRUE,\"In\",\"Out\")","v":"Out"},{"$f":"Conversions!S20","v":""}]
[null,{"$f":"IF(Conversions!P21=TRUE,\"In\",\"Out\")","v":"Out"},{"$f":"Conversions!S21","v":""}]
[null,{"$f":"IF(Conversions!P22=TRUE,\"In\",\"Out\")","v":"Out"},{"$f":"Conversions!S22","v":""},null,"Additional Notes: "]
[null,{"$f":"IF(Conversions!P23=TRUE,\"In\",\"Out\")","v":"Out"},{"$f":"Conversions!S23","v":""}]
[null,{"$f":"IF(Conversions!P24=TRUE,\"In\",\"Out\")","v":"Out"},{"$f":"Conversions!S24","v":""}]
[null,{"$f":"IF(Conversions!P25=TRUE,\"In\",\"Out\")","v":"Out"},{"$f":"Conversions!S25","v":""},null,"Notes:"]
[null,{"$f":"IF(Conversions!P26=TRUE,\"In\",\"Out\")","v":"Out"},{"$f":"Conversions!S26","v":""}]
[null,{"$f":"IF(Conversions!P27=TRUE,\"In\",\"Out\")","v":"Out"},{"$f":"Conversions!S27","v":""},null,{"$f":"IFERROR(INDEX(C$2:C$331,SMALL(IF(B$2:B$331=\"In\",ROW(C$2:C$331)-ROW(C$2)+1),ROW(C1))),\"\")","v":""}]
[null,{"$f":"IF(Conversions!P28=TRUE,\"In\",\"Out\")","v":"Out"},{"$f":"Conversions!S28","v":""},null,{"$f":"IFERROR(INDEX(C$2:C$344,SMALL(IF(B$2:B$344=\"In\",ROW(C$2:C$344)-ROW(C$2)+1),ROW(C2))),\"\")","v":""}]
[null,{"$f":"IF(Conversions!P29=TRUE,\"In\",\"Out\")","v":"Out"},{"$f":"Conversions!S29","v":""},null,{"$f":"IFERROR(INDEX(C$2:C$344,SMALL(IF(B$2:B$344=\"In\",ROW(C$2:C$344)-ROW(C$2)+1),ROW(C3))),\"\")","v":""}]
[null,{"$f":"IF(Conversions!P30=TRUE,\"In\",\"Out\")","v":"Out"},{"$f":"Conversions!S30","v":"\""},null,{"$f":"IFERROR(INDEX(C$2:C$344,SMALL(IF(B$2:B$344=\"In\",ROW(C$2:C$344)-ROW(C$2)+1),ROW(C4))),\"\")","v":""}]
[null,{"$f":"IF(Conversions!P31=TRUE,\"In\",\"Out\")","v":"Out"},{"$f":"Conversions!S31","v":0},null,{"$f":"IFERROR(INDEX(C$2:C$344,SMALL(IF(B$2:B$344=\"In\",ROW(C$2:C$344)-ROW(C$2)+1),ROW(C5))),\"\")","v":""}]
[null,{"$f":"IF(Conversions!P32=TRUE,\"In\",\"Out\")","v":"Out"},{"$f":"Conversions!S32","v":""},null,{"$f":"IFERROR(INDEX(C$2:C$344,SMALL(IF(B$2:B$344=\"In\",ROW(C$2:C$344)-ROW(C$2)+1),ROW(C6))),\"\")","v":""}]
[null,{"$f":"IF(Conversions!P33=TRUE,\"In\",\"Out\")","v":"Out"},{"$f":"Conversions!S33","v":""},null,{"$f":"IFERROR(INDEX(C$2:C$344,SMALL(IF(B$2:B$344=\"In\",ROW(C$2:C$344)-ROW(C$2)+1),ROW(C7))),\"\")","v":""}]
[null,{"$f":"IF(Conversions!P34=TRUE,\"In\",\"Out\")","v":"Out"},{"$f":"Conversions!S34","v":""},null,{"$f":"IFERROR(INDEX(C$2:C$344,SMALL(IF(B$2:B$344=\"In\",ROW(C$2:C$344)-ROW(C$2)+1),ROW(C8))),\"\")","v":""}]
[null,{"$f":"IF(Conversions!P35=TRUE,\"In\",\"Out\")","v":"Out"},{"$f":"Conversions!S35","v":""},null,{"$f":"IFERROR(INDEX(C$2:C$344,SMALL(IF(B$2:B$344=\"In\",ROW(C$2:C$344)-ROW(C$2)+1),ROW(C9))),\"\")","v":""}]
[null,{"$f":"IF(Conversions!P36=TRUE,\"In\",\"Out\")","v":"Out"},{"$f":"Conversions!S36","v":""},null,{"$f":"IFERROR(INDEX(C$2:C$344,SMALL(IF(B$2:B$344=\"In\",ROW(C$2:C$344)-ROW(C$2)+1),ROW(C10))),\"\")","v":""}]
[null,{"$f":"IF(Conversions!P37=TRUE,\"In\",\"Out\")","v":"Out"},{"$f":"Conversions!S37","v":"\""},null,{"$f":"IFERROR(INDEX(C$2:C$344,SMALL(IF(B$2:B$344=\"In\",ROW(C$2:C$344)-ROW(C$2)+1),ROW(C11))),\"\")","v":""}]
[null,{"$f":"IF(Conversions!P38=TRUE,\"In\",\"Out\")","v":"Out"},{"$f":"Conversions!S38","v":0},null,{"$f":"IFERROR(INDEX(C$2:C$344,SMALL(IF(B$2:B$344=\"In\",ROW(C$2:C$344)-ROW(C$2)+1),ROW(C12))),\"\")","v":""}]
[null,{"$f":"IF(Conversions!P39=TRUE,\"In\",\"Out\")","v":"Out"},{"$f":"Conversions!S39","v":0},null,{"$f":"IFERROR(INDEX(C$2:C$344,SMALL(IF(B$2:B$344=\"In\",ROW(C$2:C$344)-ROW(C$2)+1),ROW(C13))),\"\")","v":""}]
[null,{"$f":"IF(Conversions!P40=TRUE,\"In\",\"Out\")","v":"Out"},{"$f":"Conversions!S40","v":""},null,{"$f":"IFERROR(INDEX(C$2:C$344,SMALL(IF(B$2:B$344=\"In\",ROW(C$2:C$344)-ROW(C$2)+1),ROW(C14))),\"\")","v":""}]
[null,{"$f":"IF(Conversions!P41=TRUE,\"In\",\"Out\")","v":"Out"},{"$f":"Conversions!S41","v":""},null,{"$f":"IFERROR(INDEX(C$2:C$344,SMALL(IF(B$2:B$344=\"In\",ROW(C$2:C$344)-ROW(C$2)+1),ROW(C15))),\"\")","v":""}]
[null,{"$f":"IF(Conversions!P42=TRUE,\"In\",\"Out\")","v":"Out"},{"$f":"Conversions!S42","v":""},null,{"$f":"IFERROR(INDEX(C$2:C$344,SMALL(IF(B$2:B$344=\"In\",ROW(C$2:C$344)-ROW(C$2)+1),ROW(C16))),\"\")","v":""}]
[null,{"$f":"IF(Conversions!P43=TRUE,\"In\",\"Out\")","v":"Out"},{"$f":"Conversions!S43","v":""},null,{"$f":"IFERROR(INDEX(C$2:C$344,SMALL(IF(B$2:B$344=\"In\",ROW(C$2:C$344)-ROW(C$2)+1),ROW(C17))),\"\")","v":""}]
[null,{"$f":"IF(Conversions!P44=TRUE,\"In\",\"Out\")","v":"Out"},{"$f":"Conversions!S44","v":""},null,{"$f":"IFERROR(INDEX(C$2:C$344,SMALL(IF(B$2:B$344=\"In\",ROW(C$2:C$344)-ROW(C$2)+1),ROW(C18))),\"\")","v":""}]
[null,{"$f":"IF(Conversions!P45=TRUE,\"In\",\"Out\")","v":"Out"},{"$f":"Conversions!S45","v":""},null,{"$f":"IFERROR(INDEX(C$2:C$344,SMALL(IF(B$2:B$344=\"In\",ROW(C$2:C$344)-ROW(C$2)+1),ROW(C19))),\"\")","v":""}]
[null,{"$f":"IF(Conversions!P46=TRUE,\"In\",\"Out\")","v":"Out"},{"$f":"Conversions!S46","v":"\""},null,{"$f":"IFERROR(INDEX(C$2:C$344,SMALL(IF(B$2:B$344=\"In\",ROW(C$2:C$344)-ROW(C$2)+1),ROW(C20))),\"\")","v":""}]
[null,{"$f":"IF(Conversions!P47=TRUE,\"In\",\"Out\")","v":"Out"},{"$f":"Conversions!S47","v":0},null,{"$f":"IFERROR(INDEX(C$2:C$344,SMALL(IF(B$2:B$344=\"In\",ROW(C$2:C$344)-ROW(C$2)+1),ROW(C21))),\"\")","v":""}]
[null,{"$f":"IF(Conversions!P48=TRUE,\"In\",\"Out\")","v":"Out"},{"$f":"Conversions!S48","v":0},null,{"$f":"IFERROR(INDEX(C$2:C$344,SMALL(IF(B$2:B$344=\"In\",ROW(C$2:C$344)-ROW(C$2)+1),ROW(C22))),\"\")","v":""}]
[null,{"$f":"IF(Conversions!P49=TRUE,\"In\",\"Out\")","v":"Out"},{"$f":"Conversions!S49","v":0},null,{"$f":"IFERROR(INDEX(C$2:C$344,SMALL(IF(B$2:B$344=\"In\",ROW(C$2:C$344)-ROW(C$2)+1),ROW(C23))),\"\")","v":""}]
[null,{"$f":"IF(Conversions!P50=TRUE,\"In\",\"Out\")","v":"Out"},{"$f":"Conversions!S50","v":0},null,{"$f":"IFERROR(INDEX(C$2:C$344,SMALL(IF(B$2:B$344=\"In\",ROW(C$2:C$344)-ROW(C$2)+1),ROW(C24))),\"\")","v":""}]
[null,{"$f":"IF(Conversions!P51=TRUE,\"In\",\"Out\")","v":"Out"},{"$f":"Conversions!S51","v":""},null,{"$f":"IFERROR(INDEX(C$2:C$344,SMALL(IF(B$2:B$344=\"In\",ROW(C$2:C$344)-ROW(C$2)+1),ROW(C25))),\"\")","v":""}]
[null,{"$f":"IF(Conversions!P52=TRUE,\"In\",\"Out\")","v":"Out"},{"$f":"Conversions!S52","v":""},null,{"$f":"IFERROR(INDEX(C$2:C$344,SMALL(IF(B$2:B$344=\"In\",ROW(C$2:C$344)-ROW(C$2)+1),ROW(C26))),\"\")","v":""}]
[null,{"$f":"IF(Conversions!P53=TRUE,\"In\",\"Out\")","v":"Out"},{"$f":"Conversions!S53","v":""},null,{"$f":"IFERROR(INDEX(C$2:C$344,SMALL(IF(B$2:B$344=\"In\",ROW(C$2:C$344)-ROW(C$2)+1),ROW(C27))),\"\")","v":""}]
[null,{"$f":"IF(Conversions!P54=TRUE,\"In\",\"Out\")","v":"Out"},{"$f":"Conversions!S54","v":""},null,{"$f":"IFERROR(INDEX(C$2:C$344,SMALL(IF(B$2:B$344=\"In\",ROW(C$2:C$344)-ROW(C$2)+1),ROW(C28))),\"\")","v":""}]
[null,{"$f":"IF(Conversions!P55=TRUE,\"In\",\"Out\")","v":"Out"},{"$f":"Conversions!S55","v":""},null,{"$f":"IFERROR(INDEX(C$2:C$344,SMALL(IF(B$2:B$344=\"In\",ROW(C$2:C$344)-ROW(C$2)+1),ROW(C29))),\"\")","v":""}]
[null,{"$f":"IF(Conversions!P56=TRUE,\"In\",\"Out\")","v":"Out"},{"$f":"Conversions!S56","v":""},null,{"$f":"IFERROR(INDEX(C$2:C$344,SMALL(IF(B$2:B$344=\"In\",ROW(C$2:C$344)-ROW(C$2)+1),ROW(C30))),\"\")","v":""}]
[null,{"$f":"IF(Conversions!P57=TRUE,\"In\",\"Out\")","v":"Out"},{"$f":"Conversions!S57","v":""},null,{"$f":"IFERROR(INDEX(C$2:C$344,SMALL(IF(B$2:B$344=\"In\",ROW(C$2:C$344)-ROW(C$2)+1),ROW(C31))),\"\")","v":""}]
[null,{"$f":"IF(Conversions!P58=TRUE,\"In\",\"Out\")","v":"Out"},{"$f":"Conversions!S58","v":""},null,{"$f":"IFERROR(INDEX(C$2:C$344,SMALL(IF(B$2:B$344=\"In\",ROW(C$2:C$344)-ROW(C$2)+1),ROW(C32))),\"\")","v":""}]
[null,{"$f":"IF(Conversions!P59=TRUE,\"In\",\"Out\")","v":"Out"},{"$f":"Conversions!S59","v":""},null,{"$f":"IFERROR(INDEX(C$2:C$344,SMALL(IF(B$2:B$344=\"In\",ROW(C$2:C$344)-ROW(C$2)+1),ROW(C33))),\"\")","v":""}]
[null,{"$f":"IF(Conversions!P60=TRUE,\"In\",\"Out\")","v":"Out"},{"$f":"Conversions!S60","v":""},null,{"$f":"IFERROR(INDEX(C$2:C$344,SMALL(IF(B$2:B$344=\"In\",ROW(C$2:C$344)-ROW(C$2)+1),ROW(C34))),\"\")","v":""}]
[null,{"$f":"IF(Conversions!P61=TRUE,\"In\",\"Out\")","v":"Out"},{"$f":"Conversions!S61","v":"\""},null,{"$f":"IFERROR(INDEX(C$2:C$344,SMALL(IF(B$2:B$344=\"In\",ROW(C$2:C$344)-ROW(C$2)+1),ROW(C35))),\"\")","v":""}]
[null,{"$f":"IF(Conversions!P62=TRUE,\"In\",\"Out\")","v":"Out"},{"$f":"Conversions!S62","v":0},null,{"$f":"IFERROR(INDEX(C$2:C$344,SMALL(IF(B$2:B$344=\"In\",ROW(C$2:C$344)-ROW(C$2)+1),ROW(C36))),\"\")","v":""}]
[null,{"$f":"IF(Conversions!P63=TRUE,\"In\",\"Out\")","v":"Out"},{"$f":"Conversions!S63","v":""},null,{"$f":"IFERROR(INDEX(C$2:C$344,SMALL(IF(B$2:B$344=\"In\",ROW(C$2:C$344)-ROW(C$2)+1),ROW(C37))),\"\")","v":""}]
[null,{"$f":"IF(Conversions!P64=TRUE,\"In\",\"Out\")","v":"Out"},{"$f":"Conversions!S64","v":""},null,{"$f":"IFERROR(INDEX(C$2:C$344,SMALL(IF(B$2:B$344=\"In\",ROW(C$2:C$344)-ROW(C$2)+1),ROW(C38))),\"\")","v":""}]
[null,{"$f":"IF(Conversions!P65=TRUE,\"In\",\"Out\")","v":"Out"},{"$f":"Conversions!S65","v":""},null,{"$f":"IFERROR(INDEX(C$2:C$344,SMALL(IF(B$2:B$344=\"In\",ROW(C$2:C$344)-ROW(C$2)+1),ROW(C39))),\"\")","v":""}]
[null,{"$f":"IF(Conversions!P66=TRUE,\"In\",\"Out\")","v":"Out"},{"$f":"Conversions!S66","v":""},null,{"$f":"IFERROR(INDEX(C$2:C$344,SMALL(IF(B$2:B$344=\"In\",ROW(C$2:C$344)-ROW(C$2)+1),ROW(C40))),\"\")","v":""}]
[null,{"$f":"IF(Conversions!P67=TRUE,\"In\",\"Out\")","v":"Out"},{"$f":"Conversions!S67","v":""},null,{"$f":"IFERROR(INDEX(C$2:C$344,SMALL(IF(B$2:B$344=\"In\",ROW(C$2:C$344)-ROW(C$2)+1),ROW(C41))),\"\")","v":""}]
[null,{"$f":"IF(Conversions!P68=TRUE,\"In\",\"Out\")","v":"Out"},{"$f":"Conversions!S68","v":"\""},null,{"$f":"IFERROR(INDEX(C$2:C$344,SMALL(IF(B$2:B$344=\"In\",ROW(C$2:C$344)-ROW(C$2)+1),ROW(C42))),\"\")","v":""}]
[null,{"$f":"IF(Conversions!P69=TRUE,\"In\",\"Out\")","v":"Out"},{"$f":"Conversions!S69","v":0},null,{"$f":"IFERROR(INDEX(C$2:C$344,SMALL(IF(B$2:B$344=\"In\",ROW(C$2:C$344)-ROW(C$2)+1),ROW(C43))),\"\")","v":""}]
[null,{"$f":"IF(Conversions!P70=TRUE,\"In\",\"Out\")","v":"Out"},{"$f":"Conversions!S70","v":0},null,{"$f":"IFERROR(INDEX(C$2:C$344,SMALL(IF(B$2:B$344=\"In\",ROW(C$2:C$344)-ROW(C$2)+1),ROW(C44))),\"\")","v":""}]
[null,{"$f":"IF(Conversions!P71=TRUE,\"In\",\"Out\")","v":"Out"},{"$f":"Conversions!S71","v":""},null,{"$f":"IFERROR(INDEX(C$2:C$344,SMALL(IF(B$2:B$344=\"In\",ROW(C$2:C$344)-ROW(C$2)+1),ROW(C45))),\"\")","v":""}]
[null,{"$f":"IF(Conversions!P72=TRUE,\"In\",\"Out\")","v":"Out"},{"$f":"Conversions!S72","v":""},null,{"$f":"IFERROR(INDEX(C$2:C$344,SMALL(IF(B$2:B$344=\"In\",ROW(C$2:C$344)-ROW(C$2)+1),ROW(C46))),\"\")","v":""}]
[null,{"$f":"IF(Conversions!P73=TRUE,\"In\",\"Out\")","v":"Out"},{"$f":"Conversions!S73","v":""},null,{"$f":"IFERROR(INDEX(C$2:C$344,SMALL(IF(B$2:B$344=\"In\",ROW(C$2:C$344)-ROW(C$2)+1),ROW(C47))),\"\")","v":""}]
[null,{"$f":"IF(Conversions!P74=TRUE,\"In\",\"Out\")","v":"Out"},{"$f":"Conversions!S74","v":"\""},null,{"$f":"IFERROR(INDEX(C$2:C$344,SMALL(IF(B$2:B$344=\"In\",ROW(C$2:C$344)-ROW(C$2)+1),ROW(C48))),\"\")","v":""}]
[null,{"$f":"IF(Conversions!P75=TRUE,\"In\",\"Out\")","v":"Out"},{"$f":"Conversions!S75","v":0},null,{"$f":"IFERROR(INDEX(C$2:C$344,SMALL(IF(B$2:B$344=\"In\",ROW(C$2:C$344)-ROW(C$2)+1),ROW(C49))),\"\")","v":""}]
[null,{"$f":"IF(Conversions!P76=TRUE,\"In\",\"Out\")","v":"Out"},{"$f":"Conversions!S76","v":0},null,{"$f":"IFERROR(INDEX(C$2:C$344,SMALL(IF(B$2:B$344=\"In\",ROW(C$2:C$344)-ROW(C$2)+1),ROW(C50))),\"\")","v":""}]
[null,{"$f":"IF(Conversions!P77=TRUE,\"In\",\"Out\")","v":"Out"},{"$f":"Conversions!S77","v":""},null,{"$f":"IFERROR(INDEX(C$2:C$344,SMALL(IF(B$2:B$344=\"In\",ROW(C$2:C$344)-ROW(C$2)+1),ROW(C51))),\"\")","v":""}]
[null,{"$f":"IF(Conversions!P78=TRUE,\"In\",\"Out\")","v":"Out"},{"$f":"Conversions!S78","v":""},null,{"$f":"IFERROR(INDEX(C$2:C$344,SMALL(IF(B$2:B$344=\"In\",ROW(C$2:C$344)-ROW(C$2)+1),ROW(C52))),\"\")","v":""}]
[null,{"$f":"IF(Conversions!P79=TRUE,\"In\",\"Out\")","v":"Out"},{"$f":"Conversions!S79","v":""},null,{"$f":"IFERROR(INDEX(C$2:C$344,SMALL(IF(B$2:B$344=\"In\",ROW(C$2:C$344)-ROW(C$2)+1),ROW(C53))),\"\")","v":""}]
[null,{"$f":"IF(Conversions!P80=TRUE,\"In\",\"Out\")","v":"Out"},{"$f":"Conversions!S80","v":""},null,{"$f":"IFERROR(INDEX(C$2:C$344,SMALL(IF(B$2:B$344=\"In\",ROW(C$2:C$344)-ROW(C$2)+1),ROW(C54))),\"\")","v":""}]
[null,{"$f":"IF(Conversions!P81=TRUE,\"In\",\"Out\")","v":"Out"},{"$f":"Conversions!S81","v":""},null,{"$f":"IFERROR(INDEX(C$2:C$344,SMALL(IF(B$2:B$344=\"In\",ROW(C$2:C$344)-ROW(C$2)+1),ROW(C55))),\"\")","v":""}]
[null,{"$f":"IF(Conversions!P82=TRUE,\"In\",\"Out\")","v":"Out"},{"$f":"Conversions!S82","v":""},null,{"$f":"IFERROR(INDEX(C$2:C$344,SMALL(IF(B$2:B$344=\"In\",ROW(C$2:C$344)-ROW(C$2)+1),ROW(C56))),\"\")","v":""}]
[null,{"$f":"IF(Conversions!P83=TRUE,\"In\",\"Out\")","v":"Out"},{"$f":"Conversions!S83","v":""},null,{"$f":"IFERROR(INDEX(C$2:C$344,SMALL(IF(B$2:B$344=\"In\",ROW(C$2:C$344)-ROW(C$2)+1),ROW(C57))),\"\")","v":""}]
[null,{"$f":"IF(Conversions!P84=TRUE,\"In\",\"Out\")","v":"Out"},{"$f":"Conversions!S84","v":"\""},null,{"$f":"IFERROR(INDEX(C$2:C$344,SMALL(IF(B$2:B$344=\"In\",ROW(C$2:C$344)-ROW(C$2)+1),ROW(C58))),\"\")","v":""}]
[null,{"$f":"IF(Conversions!P85=TRUE,\"In\",\"Out\")","v":"Out"},{"$f":"Conversions!S85","v":0},null,{"$f":"IFERROR(INDEX(C$2:C$344,SMALL(IF(B$2:B$344=\"In\",ROW(C$2:C$344)-ROW(C$2)+1),ROW(C59))),\"\")","v":""}]
[null,{"$f":"IF(Conversions!P86=TRUE,\"In\",\"Out\")","v":"Out"},{"$f":"Conversions!S86","v":0},null,{"$f":"IFERROR(INDEX(C$2:C$344,SMALL(IF(B$2:B$344=\"In\",ROW(C$2:C$344)-ROW(C$2)+1),ROW(C60))),\"\")","v":""}]
[null,{"$f":"IF(Conversions!P87=TRUE,\"In\",\"Out\")","v":"Out"},{"$f":"Conversions!S87","v":""},null,{"$f":"IFERROR(INDEX(C$2:C$344,SMALL(IF(B$2:B$344=\"In\",ROW(C$2:C$344)-ROW(C$2)+1),ROW(C61))),\"\")","v":""}]
[null,{"$f":"IF(Conversions!P88=TRUE,\"In\",\"Out\")","v":"Out"},{"$f":"Conversions!S88","v":""},null,{"$f":"IFERROR(INDEX(C$2:C$344,SMALL(IF(B$2:B$344=\"In\",ROW(C$2:C$344)-ROW(C$2)+1),ROW(C62))),\"\")","v":""}]
[null,{"$f":"IF(Conversions!P89=TRUE,\"In\",\"Out\")","v":"Out"},{"$f":"Conversions!S89","v":""},null,{"$f":"IFERROR(INDEX(C$2:C$344,SMALL(IF(B$2:B$344=\"In\",ROW(C$2:C$344)-ROW(C$2)+1),ROW(C63))),\"\")","v":""}]
[null,{"$f":"IF(Conversions!P90=TRUE,\"In\",\"Out\")","v":"Out"},{"$f":"Conversions!S90","v":""},null,{"$f":"IFERROR(INDEX(C$2:C$344,SMALL(IF(B$2:B$344=\"In\",ROW(C$2:C$344)-ROW(C$2)+1),ROW(C64))),\"\")","v":""}]
[null,{"$f":"IF(Conversions!P91=TRUE,\"In\",\"Out\")","v":"Out"},{"$f":"Conversions!S91","v":""},null,{"$f":"IFERROR(INDEX(C$2:C$344,SMALL(IF(B$2:B$344=\"In\",ROW(C$2:C$344)-ROW(C$2)+1),ROW(C65))),\"\")","v":""}]
[null,{"$f":"IF(Conversions!P92=TRUE,\"In\",\"Out\")","v":"Out"},{"$f":"Conversions!S92","v":""},null,{"$f":"IFERROR(INDEX(C$2:C$344,SMALL(IF(B$2:B$344=\"In\",ROW(C$2:C$344)-ROW(C$2)+1),ROW(C66))),\"\")","v":""}]
[null,{"$f":"IF(Conversions!P93=TRUE,\"In\",\"Out\")","v":"Out"},{"$f":"Conversions!S93","v":""},null,{"$f":"IFERROR(INDEX(C$2:C$344,SMALL(IF(B$2:B$344=\"In\",ROW(C$2:C$344)-ROW(C$2)+1),ROW(C67))),\"\")","v":""}]
[null,{"$f":"IF(Conversions!P94=TRUE,\"In\",\"Out\")","v":"Out"},{"$f":"Conversions!S94","v":""},null,{"$f":"IFERROR(INDEX(C$2:C$344,SMALL(IF(B$2:B$344=\"In\",ROW(C$2:C$344)-ROW(C$2)+1),ROW(C68))),\"\")","v":""}]
[null,{"$f":"IF(Conversions!P95=TRUE,\"In\",\"Out\")","v":"Out"},{"$f":"Conversions!S95","v":""},null,{"$f":"IFERROR(INDEX(C$2:C$344,SMALL(IF(B$2:B$344=\"In\",ROW(C$2:C$344)-ROW(C$2)+1),ROW(C69))),\"\")","v":""}]
[null,{"$f":"IF(Conversions!P96=TRUE,\"In\",\"Out\")","v":"Out"},{"$f":"Conversions!S96","v":"\""},null,{"$f":"IFERROR(INDEX(C$2:C$344,SMALL(IF(B$2:B$344=\"In\",ROW(C$2:C$344)-ROW(C$2)+1),ROW(C70))),\"\")","v":""}]
[null,{"$f":"IF(Conversions!P97=TRUE,\"In\",\"Out\")","v":"Out"},{"$f":"Conversions!S97","v":0},null,{"$f":"IFERROR(INDEX(C$2:C$344,SMALL(IF(B$2:B$344=\"In\",ROW(C$2:C$344)-ROW(C$2)+1),ROW(C71))),\"\")","v":""}]
[null,{"$f":"IF(Conversions!P98=TRUE,\"In\",\"Out\")","v":"Out"},{"$f":"Conversions!S98","v":0},null,{"$f":"IFERROR(INDEX(C$2:C$344,SMALL(IF(B$2:B$344=\"In\",ROW(C$2:C$344)-ROW(C$2)+1),ROW(C72))),\"\")","v":""}]
[null,{"$f":"IF(Conversions!P99=TRUE,\"In\",\"Out\")","v":"Out"},{"$f":"Conversions!S99","v":""},null,{"$f":"IFERROR(INDEX(C$2:C$344,SMALL(IF(B$2:B$344=\"In\",ROW(C$2:C$344)-ROW(C$2)+1),ROW(C73))),\"\")","v":""}]
[null,{"$f":"IF(Conversions!P100=TRUE,\"In\",\"Out\")","v":"Out"},{"$f":"Conversions!S100","v":""},null,{"$f":"IFERROR(INDEX(C$2:C$344,SMALL(IF(B$2:B$344=\"In\",ROW(C$2:C$344)-ROW(C$2)+1),ROW(C74))),\"\")","v":""}]
[null,{"$f":"IF(Conversions!P101=TRUE,\"In\",\"Out\")","v":"Out"},{"$f":"Conversions!S101","v":""},null,{"$f":"IFERROR(INDEX(C$2:C$344,SMALL(IF(B$2:B$344=\"In\",ROW(C$2:C$344)-ROW(C$2)+1),ROW(C75))),\"\")","v":""}]
[null,{"$f":"IF(Conversions!P102=TRUE,\"In\",\"Out\")","v":"Out"},{"$f":"Conversions!S102","v":""},null,{"$f":"IFERROR(INDEX(C$2:C$344,SMALL(IF(B$2:B$344=\"In\",ROW(C$2:C$344)-ROW(C$2)+1),ROW(C76))),\"\")","v":""}]
[null,{"$f":"IF(Conversions!P103=TRUE,\"In\",\"Out\")","v":"Out"},{"$f":"Conversions!S103","v":"\""},null,{"$f":"IFERROR(INDEX(C$2:C$344,SMALL(IF(B$2:B$344=\"In\",ROW(C$2:C$344)-ROW(C$2)+1),ROW(C77))),\"\")","v":""}]
[null,{"$f":"IF(Conversions!P104=TRUE,\"In\",\"Out\")","v":"Out"},{"$f":"Conversions!S104","v":0},null,{"$f":"IFERROR(INDEX(C$2:C$344,SMALL(IF(B$2:B$344=\"In\",ROW(C$2:C$344)-ROW(C$2)+1),ROW(C78))),\"\")","v":""}]
[null,{"$f":"IF(Conversions!P105=TRUE,\"In\",\"Out\")","v":"Out"},{"$f":"Conversions!S105","v":0},null,{"$f":"IFERROR(INDEX(C$2:C$344,SMALL(IF(B$2:B$344=\"In\",ROW(C$2:C$344)-ROW(C$2)+1),ROW(C79))),\"\")","v":""}]
[null,{"$f":"IF(Conversions!P106=TRUE,\"In\",\"Out\")","v":"Out"},{"$f":"Conversions!S106","v":""},null,{"$f":"IFERROR(INDEX(C$2:C$344,SMALL(IF(B$2:B$344=\"In\",ROW(C$2:C$344)-ROW(C$2)+1),ROW(C80))),\"\")","v":""}]
[null,{"$f":"IF(Conversions!P107=TRUE,\"In\",\"Out\")","v":"Out"},{"$f":"Conversions!S107","v":""},null,{"$f":"IFERROR(INDEX(C$2:C$344,SMALL(IF(B$2:B$344=\"In\",ROW(C$2:C$344)-ROW(C$2)+1),ROW(C81))),\"\")","v":""}]
[null,{"$f":"IF(Conversions!P108=TRUE,\"In\",\"Out\")","v":"Out"},{"$f":"Conversions!S108","v":""},null,{"$f":"IFERROR(INDEX(C$2:C$344,SMALL(IF(B$2:B$344=\"In\",ROW(C$2:C$344)-ROW(C$2)+1),ROW(C82))),\"\")","v":""}]
[null,{"$f":"IF(Conversions!P109=TRUE,\"In\",\"Out\")","v":"Out"},{"$f":"Conversions!S109","v":""},null,{"$f":"IFERROR(INDEX(C$2:C$344,SMALL(IF(B$2:B$344=\"In\",ROW(C$2:C$344)-ROW(C$2)+1),ROW(C83))),\"\")","v":""}]
[null,{"$f":"IF(Conversions!P110=TRUE,\"In\",\"Out\")","v":"Out"},{"$f":"Conversions!S110","v":""},null,{"$f":"IFERROR(INDEX(C$2:C$344,SMALL(IF(B$2:B$344=\"In\",ROW(C$2:C$344)-ROW(C$2)+1),ROW(C84))),\"\")","v":""}]
[null,{"$f":"IF(Conversions!P111=TRUE,\"In\",\"Out\")","v":"Out"},{"$f":"Conversions!S111","v":""},null,{"$f":"IFERROR(INDEX(C$2:C$344,SMALL(IF(B$2:B$344=\"In\",ROW(C$2:C$344)-ROW(C$2)+1),ROW(C85))),\"\")","v":""}]
[null,{"$f":"IF(Conversions!P113=TRUE,\"In\",\"Out\")","v":"Out"},{"$f":"Conversions!S113","v":"\""},null,{"$f":"IFERROR(INDEX(C$2:C$344,SMALL(IF(B$2:B$344=\"In\",ROW(C$2:C$344)-ROW(C$2)+1),ROW(C86))),\"\")","v":""}]
[null,{"$f":"IF(Conversions!P114=TRUE,\"In\",\"Out\")","v":"Out"},{"$f":"Conversions!S114","v":0},null,{"$f":"IFERROR(INDEX(C$2:C$344,SMALL(IF(B$2:B$344=\"In\",ROW(C$2:C$344)-ROW(C$2)+1),ROW(C87))),\"\")","v":""}]
[null,{"$f":"IF(Conversions!P115=TRUE,\"In\",\"Out\")","v":"Out"},{"$f":"Conversions!S115","v":""},null,{"$f":"IFERROR(INDEX(C$2:C$344,SMALL(IF(B$2:B$344=\"In\",ROW(C$2:C$344)-ROW(C$2)+1),ROW(C88))),\"\")","v":""}]
[null,{"$f":"IF(Conversions!P116=TRUE,\"In\",\"Out\")","v":"Out"},{"$f":"Conversions!S116","v":""},null,{"$f":"IFERROR(INDEX(C$2:C$344,SMALL(IF(B$2:B$344=\"In\",ROW(C$2:C$344)-ROW(C$2)+1),ROW(C89))),\"\")","v":""}]
[null,{"$f":"IF(Conversions!P117=TRUE,\"In\",\"Out\")","v":"Out"},{"$f":"Conversions!S117","v":""},null,{"$f":"IFERROR(INDEX(C$2:C$344,SMALL(IF(B$2:B$344=\"In\",ROW(C$2:C$344)-ROW(C$2)+1),ROW(C90))),\"\")","v":""}]
[null,{"$f":"IF(Conversions!P118=TRUE,\"In\",\"Out\")","v":"Out"},{"$f":"Conversions!S118","v":""},null,{"$f":"IFERROR(INDEX(C$2:C$344,SMALL(IF(B$2:B$344=\"In\",ROW(C$2:C$344)-ROW(C$2)+1),ROW(C91))),\"\")","v":""}]
[null,{"$f":"IF(Conversions!P119=TRUE,\"In\",\"Out\")","v":"Out"},{"$f":"Conversions!S119","v":""},null,{"$f":"IFERROR(INDEX(C$2:C$344,SMALL(IF(B$2:B$344=\"In\",ROW(C$2:C$344)-ROW(C$2)+1),ROW(C92))),\"\")","v":""}]
[null,{"$f":"IF(Conversions!P120=TRUE,\"In\",\"Out\")","v":"Out"},{"$f":"Conversions!S120","v":"\""},null,{"$f":"IFERROR(INDEX(C$2:C$344,SMALL(IF(B$2:B$344=\"In\",ROW(C$2:C$344)-ROW(C$2)+1),ROW(C93))),\"\")","v":""}]
[null,{"$f":"IF(Conversions!P121=TRUE,\"In\",\"Out\")","v":"Out"},{"$f":"Conversions!S121","v":0},null,{"$f":"IFERROR(INDEX(C$2:C$344,SMALL(IF(B$2:B$344=\"In\",ROW(C$2:C$344)-ROW(C$2)+1),ROW(C94))),\"\")","v":""}]
[null,{"$f":"IF(Conversions!P122=TRUE,\"In\",\"Out\")","v":"Out"},{"$f":"Conversions!S122","v":""},null,{"$f":"IFERROR(INDEX(C$2:C$344,SMALL(IF(B$2:B$344=\"In\",ROW(C$2:C$344)-ROW(C$2)+1),ROW(C95))),\"\")","v":""}]
[null,{"$f":"IF(Conversions!P123=TRUE,\"In\",\"Out\")","v":"Out"},{"$f":"Conversions!S123","v":""},null,{"$f":"IFERROR(INDEX(C$2:C$344,SMALL(IF(B$2:B$344=\"In\",ROW(C$2:C$344)-ROW(C$2)+1),ROW(C96))),\"\")","v":""}]
[null,{"$f":"IF(Conversions!P124=TRUE,\"In\",\"Out\")","v":"Out"},{"$f":"Conversions!S124","v":""},null,{"$f":"IFERROR(INDEX(C$2:C$344,SMALL(IF(B$2:B$344=\"In\",ROW(C$2:C$344)-ROW(C$2)+1),ROW(C97))),\"\")","v":""}]
[null,{"$f":"IF(Conversions!P125=TRUE,\"In\",\"Out\")","v":"Out"},{"$f":"Conversions!S125","v":""},null,{"$f":"IFERROR(INDEX(C$2:C$344,SMALL(IF(B$2:B$344=\"In\",ROW(C$2:C$344)-ROW(C$2)+1),ROW(C98))),\"\")","v":""}]
[null,{"$f":"IF(Conversions!P126=TRUE,\"In\",\"Out\")","v":"Out"},{"$f":"Conversions!S126","v":""},null,{"$f":"IFERROR(INDEX(C$2:C$344,SMALL(IF(B$2:B$344=\"In\",ROW(C$2:C$344)-ROW(C$2)+1),ROW(C99))),\"\")","v":""}]
[null,{"$f":"IF(Conversions!P127=TRUE,\"In\",\"Out\")","v":"Out"},{"$f":"Conversions!S127","v":"\""},null,{"$f":"IFERROR(INDEX(C$2:C$344,SMALL(IF(B$2:B$344=\"In\",ROW(C$2:C$344)-ROW(C$2)+1),ROW(C100))),\"\")","v":""}]
[null,{"$f":"IF(Conversions!P128=TRUE,\"In\",\"Out\")","v":"Out"},{"$f":"Conversions!S128","v":0},null,{"$f":"IFERROR(INDEX(C$2:C$344,SMALL(IF(B$2:B$344=\"In\",ROW(C$2:C$344)-ROW(C$2)+1),ROW(C101))),\"\")","v":""}]
[null,{"$f":"IF(Conversions!P129=TRUE,\"In\",\"Out\")","v":"Out"},{"$f":"Conversions!S129","v":0},null,{"$f":"IFERROR(INDEX(C$2:C$344,SMALL(IF(B$2:B$344=\"In\",ROW(C$2:C$344)-ROW(C$2)+1),ROW(C102))),\"\")","v":""}]
[null,{"$f":"IF(Conversions!P130=TRUE,\"In\",\"Out\")","v":"Out"},{"$f":"Conversions!S130","v":0},null,{"$f":"IFERROR(INDEX(C$2:C$344,SMALL(IF(B$2:B$344=\"In\",ROW(C$2:C$344)-ROW(C$2)+1),ROW(C103))),\"\")","v":""}]
[null,{"$f":"IF(Conversions!P131=TRUE,\"In\",\"Out\")","v":"Out"},{"$f":"Conversions!S131","v":0},null,{"$f":"IFERROR(INDEX(C$2:C$344,SMALL(IF(B$2:B$344=\"In\",ROW(C$2:C$344)-ROW(C$2)+1),ROW(C104))),\"\")","v":""}]
[null,{"$f":"IF(Conversions!P132=TRUE,\"In\",\"Out\")","v":"Out"},{"$f":"Conversions!S132","v":""},null,{"$f":"IFERROR(INDEX(C$2:C$344,SMALL(IF(B$2:B$344=\"In\",ROW(C$2:C$344)-ROW(C$2)+1),ROW(C105))),\"\")","v":""}]
[null,{"$f":"IF(Conversions!P133=TRUE,\"In\",\"Out\")","v":"Out"},{"$f":"Conversions!S133","v":""},null,{"$f":"IFERROR(INDEX(C$2:C$344,SMALL(IF(B$2:B$344=\"In\",ROW(C$2:C$344)-ROW(C$2)+1),ROW(C106))),\"\")","v":""}]
[null,{"$f":"IF(Conversions!P134=TRUE,\"In\",\"Out\")","v":"Out"},{"$f":"Conversions!S134","v":""},null,{"$f":"IFERROR(INDEX(C$2:C$344,SMALL(IF(B$2:B$344=\"In\",ROW(C$2:C$344)-ROW(C$2)+1),ROW(C107))),\"\")","v":""}]
[null,{"$f":"IF(Conversions!P135=TRUE,\"In\",\"Out\")","v":"Out"},{"$f":"Conversions!S135","v":""},null,{"$f":"IFERROR(INDEX(C$2:C$344,SMALL(IF(B$2:B$344=\"In\",ROW(C$2:C$344)-ROW(C$2)+1),ROW(C108))),\"\")","v":""}]
[null,{"$f":"IF(Conversions!P136=TRUE,\"In\",\"Out\")","v":"Out"},{"$f":"Conversions!S136","v":""},null,{"$f":"IFERROR(INDEX(C$2:C$344,SMALL(IF(B$2:B$344=\"In\",ROW(C$2:C$344)-ROW(C$2)+1),ROW(C109))),\"\")","v":""}]
[null,{"$f":"IF(Conversions!P137=TRUE,\"In\",\"Out\")","v":"Out"},{"$f":"Conversions!S137","v":""},null,{"$f":"IFERROR(INDEX(C$2:C$344,SMALL(IF(B$2:B$344=\"In\",ROW(C$2:C$344)-ROW(C$2)+1),ROW(C110))),\"\")","v":""}]
[null,{"$f":"IF(Conversions!P138=TRUE,\"In\",\"Out\")","v":"Out"},{"$f":"Conversions!S138","v":""},null,{"$f":"IFERROR(INDEX(C$2:C$344,SMALL(IF(B$2:B$344=\"In\",ROW(C$2:C$344)-ROW(C$2)+1),ROW(C111))),\"\")","v":""}]
[null,{"$f":"IF(Conversions!P139=TRUE,\"In\",\"Out\")","v":"Out"},{"$f":"Conversions!S139","v":""},null,{"$f":"IFERROR(INDEX(C$2:C$344,SMALL(IF(B$2:B$344=\"In\",ROW(C$2:C$344)-ROW(C$2)+1),ROW(C112))),\"\")","v":""}]
[null,{"$f":"IF(Conversions!P140=TRUE,\"In\",\"Out\")","v":"Out"},{"$f":"Conversions!S140","v":"\""},null,{"$f":"IFERROR(INDEX(C$2:C$344,SMALL(IF(B$2:B$344=\"In\",ROW(C$2:C$344)-ROW(C$2)+1),ROW(C113))),\"\")","v":""}]
[null,{"$f":"IF(Conversions!P141=TRUE,\"In\",\"Out\")","v":"Out"},{"$f":"Conversions!S141","v":0},null,{"$f":"IFERROR(INDEX(C$2:C$344,SMALL(IF(B$2:B$344=\"In\",ROW(C$2:C$344)-ROW(C$2)+1),ROW(C114))),\"\")","v":""}]
[null,{"$f":"IF(Conversions!P142=TRUE,\"In\",\"Out\")","v":"Out"},{"$f":"Conversions!S142","v":0},null,{"$f":"IFERROR(INDEX(C$2:C$344,SMALL(IF(B$2:B$344=\"In\",ROW(C$2:C$344)-ROW(C$2)+1),ROW(C115))),\"\")","v":""}]
[null,{"$f":"IF(Conversions!P143=TRUE,\"In\",\"Out\")","v":"Out"},{"$f":"Conversions!S143","v":""},null,{"$f":"IFERROR(INDEX(C$2:C$344,SMALL(IF(B$2:B$344=\"In\",ROW(C$2:C$344)-ROW(C$2)+1),ROW(C116))),\"\")","v":""}]
[null,{"$f":"IF(Conversions!P144=TRUE,\"In\",\"Out\")","v":"Out"},{"$f":"Conversions!S144","v":""},null,{"$f":"IFERROR(INDEX(C$2:C$344,SMALL(IF(B$2:B$344=\"In\",ROW(C$2:C$344)-ROW(C$2)+1),ROW(C117))),\"\")","v":""}]
[null,{"$f":"IF(Conversions!P145=TRUE,\"In\",\"Out\")","v":"Out"},{"$f":"Conversions!S145","v":""},null,{"$f":"IFERROR(INDEX(C$2:C$344,SMALL(IF(B$2:B$344=\"In\",ROW(C$2:C$344)-ROW(C$2)+1),ROW(C118))),\"\")","v":""}]
[null,{"$f":"IF(Conversions!P146=TRUE,\"In\",\"Out\")","v":"Out"},{"$f":"Conversions!S146","v":""},null,{"$f":"IFERROR(INDEX(C$2:C$344,SMALL(IF(B$2:B$344=\"In\",ROW(C$2:C$344)-ROW(C$2)+1),ROW(C119))),\"\")","v":""}]
[null,{"$f":"IF(Conversions!P147=TRUE,\"In\",\"Out\")","v":"Out"},{"$f":"Conversions!S147","v":""},null,{"$f":"IFERROR(INDEX(C$2:C$344,SMALL(IF(B$2:B$344=\"In\",ROW(C$2:C$344)-ROW(C$2)+1),ROW(C120))),\"\")","v":""}]
[null,{"$f":"IF(Conversions!P148=TRUE,\"In\",\"Out\")","v":"Out"},{"$f":"Conversions!S148","v":""},null,{"$f":"IFERROR(INDEX(C$2:C$344,SMALL(IF(B$2:B$344=\"In\",ROW(C$2:C$344)-ROW(C$2)+1),ROW(C121))),\"\")","v":""}]
[null,{"$f":"IF(Conversions!P149=TRUE,\"In\",\"Out\")","v":"Out"},{"$f":"Conversions!S149","v":""},null,{"$f":"IFERROR(INDEX(C$2:C$344,SMALL(IF(B$2:B$344=\"In\",ROW(C$2:C$344)-ROW(C$2)+1),ROW(C122))),\"\")","v":""}]
[null,{"$f":"IF(Conversions!P150=TRUE,\"In\",\"Out\")","v":"Out"},{"$f":"Conversions!S150","v":""},null,{"$f":"IFERROR(INDEX(C$2:C$344,SMALL(IF(B$2:B$344=\"In\",ROW(C$2:C$344)-ROW(C$2)+1),ROW(C123))),\"\")","v":""}]
[null,{"$f":"IF(Conversions!P151=TRUE,\"In\",\"Out\")","v":"Out"},{"$f":"Conversions!S151","v":""},null,{"$f":"IFERROR(INDEX(C$2:C$344,SMALL(IF(B$2:B$344=\"In\",ROW(C$2:C$344)-ROW(C$2)+1),ROW(C124))),\"\")","v":""}]
[null,{"$f":"IF(Conversions!P152=TRUE,\"In\",\"Out\")","v":"Out"},{"$f":"Conversions!S152","v":""},null,{"$f":"IFERROR(INDEX(C$2:C$344,SMALL(IF(B$2:B$344=\"In\",ROW(C$2:C$344)-ROW(C$2)+1),ROW(C125))),\"\")","v":""}]
[null,{"$f":"IF(Conversions!P153=TRUE,\"In\",\"Out\")","v":"Out"},{"$f":"Conversions!S153","v":"\""},null,{"$f":"IFERROR(INDEX(C$2:C$344,SMALL(IF(B$2:B$344=\"In\",ROW(C$2:C$344)-ROW(C$2)+1),ROW(C126))),\"\")","v":""}]
[null,{"$f":"IF(Conversions!P154=TRUE,\"In\",\"Out\")","v":"Out"},{"$f":"Conversions!S154","v":0},null,{"$f":"IFERROR(INDEX(C$2:C$344,SMALL(IF(B$2:B$344=\"In\",ROW(C$2:C$344)-ROW(C$2)+1),ROW(C127))),\"\")","v":""}]
[null,{"$f":"IF(Conversions!P155=TRUE,\"In\",\"Out\")","v":"Out"},{"$f":"Conversions!S155","v":0},null,{"$f":"IFERROR(INDEX(C$2:C$344,SMALL(IF(B$2:B$344=\"In\",ROW(C$2:C$344)-ROW(C$2)+1),ROW(C128))),\"\")","v":""}]
[null,{"$f":"IF(Conversions!P156=TRUE,\"In\",\"Out\")","v":"Out"},{"$f":"Conversions!S156","v":""},null,{"$f":"IFERROR(INDEX(C$2:C$344,SMALL(IF(B$2:B$344=\"In\",ROW(C$2:C$344)-ROW(C$2)+1),ROW(C129))),\"\")","v":""}]
[null,{"$f":"IF(Conversions!P157=TRUE,\"In\",\"Out\")","v":"Out"},{"$f":"Conversions!S157","v":""},null,{"$f":"IFERROR(INDEX(C$2:C$344,SMALL(IF(B$2:B$344=\"In\",ROW(C$2:C$344)-ROW(C$2)+1),ROW(C130))),\"\")","v":""}]
[null,{"$f":"IF(Conversions!P158=TRUE,\"In\",\"Out\")","v":"Out"},{"$f":"Conversions!S158","v":""},null,{"$f":"IFERROR(INDEX(C$2:C$344,SMALL(IF(B$2:B$344=\"In\",ROW(C$2:C$344)-ROW(C$2)+1),ROW(C131))),\"\")","v":""}]
[null,{"$f":"IF(Conversions!P159=TRUE,\"In\",\"Out\")","v":"Out"},{"$f":"Conversions!S159","v":""},null,{"$f":"IFERROR(INDEX(C$2:C$344,SMALL(IF(B$2:B$344=\"In\",ROW(C$2:C$344)-ROW(C$2)+1),ROW(C132))),\"\")","v":""}]
[null,{"$f":"IF(Conversions!P160=TRUE,\"In\",\"Out\")","v":"Out"},{"$f":"Conversions!S160","v":""},null,{"$f":"IFERROR(INDEX(C$2:C$344,SMALL(IF(B$2:B$344=\"In\",ROW(C$2:C$344)-ROW(C$2)+1),ROW(C133))),\"\")","v":""}]
[null,{"$f":"IF(Conversions!P161=TRUE,\"In\",\"Out\")","v":"Out"},{"$f":"Conversions!S161","v":"\""},null,{"$f":"IFERROR(INDEX(C$2:C$344,SMALL(IF(B$2:B$344=\"In\",ROW(C$2:C$344)-ROW(C$2)+1),ROW(C134))),\"\")","v":""}]
[null,{"$f":"IF(Conversions!P162=TRUE,\"In\",\"Out\")","v":"Out"},{"$f":"Conversions!S162","v":0},null,{"$f":"IFERROR(INDEX(C$2:C$344,SMALL(IF(B$2:B$344=\"In\",ROW(C$2:C$344)-ROW(C$2)+1),ROW(C135))),\"\")","v":""}]
[null,{"$f":"IF(Conversions!P163=TRUE,\"In\",\"Out\")","v":"Out"},{"$f":"Conversions!S163","v":0},null,{"$f":"IFERROR(INDEX(C$2:C$344,SMALL(IF(B$2:B$344=\"In\",ROW(C$2:C$344)-ROW(C$2)+1),ROW(C136))),\"\")","v":""}]
[null,{"$f":"IF(Conversions!P164=TRUE,\"In\",\"Out\")","v":"Out"},{"$f":"Conversions!S164","v":0},null,{"$f":"IFERROR(INDEX(C$2:C$344,SMALL(IF(B$2:B$344=\"In\",ROW(C$2:C$344)-ROW(C$2)+1),ROW(C137))),\"\")","v":""}]
[null,{"$f":"IF(Conversions!P165=TRUE,\"In\",\"Out\")","v":"Out"},{"$f":"Conversions!S165","v":0},null,{"$f":"IFERROR(INDEX(C$2:C$344,SMALL(IF(B$2:B$344=\"In\",ROW(C$2:C$344)-ROW(C$2)+1),ROW(C138))),\"\")","v":""}]
[null,{"$f":"IF(Conversions!P166=TRUE,\"In\",\"Out\")","v":"Out"},{"$f":"Conversions!S166","v":""},null,{"$f":"IFERROR(INDEX(C$2:C$344,SMALL(IF(B$2:B$344=\"In\",ROW(C$2:C$344)-ROW(C$2)+1),ROW(C139))),\"\")","v":""}]
[null,{"$f":"IF(Conversions!P167=TRUE,\"In\",\"Out\")","v":"Out"},{"$f":"Conversions!S167","v":""},null,{"$f":"IFERROR(INDEX(C$2:C$344,SMALL(IF(B$2:B$344=\"In\",ROW(C$2:C$344)-ROW(C$2)+1),ROW(C140))),\"\")","v":""}]
[null,{"$f":"IF(Conversions!P168=TRUE,\"In\",\"Out\")","v":"Out"},{"$f":"Conversions!S168","v":""},null,{"$f":"IFERROR(INDEX(C$2:C$344,SMALL(IF(B$2:B$344=\"In\",ROW(C$2:C$344)-ROW(C$2)+1),ROW(C141))),\"\")","v":""}]
[null,{"$f":"IF(Conversions!P169=TRUE,\"In\",\"Out\")","v":"Out"},{"$f":"Conversions!S169","v":""},null,{"$f":"IFERROR(INDEX(C$2:C$344,SMALL(IF(B$2:B$344=\"In\",ROW(C$2:C$344)-ROW(C$2)+1),ROW(C142))),\"\")","v":""}]
[null,{"$f":"IF(Conversions!P170=TRUE,\"In\",\"Out\")","v":"Out"},{"$f":"Conversions!S170","v":""},null,{"$f":"IFERROR(INDEX(C$2:C$344,SMALL(IF(B$2:B$344=\"In\",ROW(C$2:C$344)-ROW(C$2)+1),ROW(C143))),\"\")","v":""}]
[null,{"$f":"IF(Conversions!P171=TRUE,\"In\",\"Out\")","v":"Out"},{"$f":"Conversions!S171","v":""},null,{"$f":"IFERROR(INDEX(C$2:C$344,SMALL(IF(B$2:B$344=\"In\",ROW(C$2:C$344)-ROW(C$2)+1),ROW(C144))),\"\")","v":""}]
[null,{"$f":"IF(Conversions!P172=TRUE,\"In\",\"Out\")","v":"Out"},{"$f":"Conversions!S172","v":""},null,{"$f":"IFERROR(INDEX(C$2:C$344,SMALL(IF(B$2:B$344=\"In\",ROW(C$2:C$344)-ROW(C$2)+1),ROW(C145))),\"\")","v":""}]
[null,{"$f":"IF(Conversions!P173=TRUE,\"In\",\"Out\")","v":"Out"},{"$f":"Conversions!S173","v":""},null,{"$f":"IFERROR(INDEX(C$2:C$344,SMALL(IF(B$2:B$344=\"In\",ROW(C$2:C$344)-ROW(C$2)+1),ROW(C146))),\"\")","v":""}]
[null,{"$f":"IF(Conversions!P174=TRUE,\"In\",\"Out\")","v":"Out"},{"$f":"Conversions!S174","v":""},null,{"$f":"IFERROR(INDEX(C$2:C$344,SMALL(IF(B$2:B$344=\"In\",ROW(C$2:C$344)-ROW(C$2)+1),ROW(C147))),\"\")","v":""}]
[null,{"$f":"IF(Conversions!P175=TRUE,\"In\",\"Out\")","v":"Out"},{"$f":"Conversions!S175","v":""},null,{"$f":"IFERROR(INDEX(C$2:C$344,SMALL(IF(B$2:B$344=\"In\",ROW(C$2:C$344)-ROW(C$2)+1),ROW(C148))),\"\")","v":""}]
[null,{"$f":"IF(Conversions!P176=TRUE,\"In\",\"Out\")","v":"Out"},{"$f":"Conversions!S176","v":""},null,{"$f":"IFERROR(INDEX(C$2:C$344,SMALL(IF(B$2:B$344=\"In\",ROW(C$2:C$344)-ROW(C$2)+1),ROW(C149))),\"\")","v":""}]
[null,{"$f":"IF(Conversions!P177=TRUE,\"In\",\"Out\")","v":"Out"},{"$f":"Conversions!S177","v":""},null,{"$f":"IFERROR(INDEX(C$2:C$344,SMALL(IF(B$2:B$344=\"In\",ROW(C$2:C$344)-ROW(C$2)+1),ROW(C150))),\"\")","v":""}]
[null,{"$f":"IF(Conversions!P178=TRUE,\"In\",\"Out\")","v":"Out"},{"$f":"Conversions!S178","v":""},null,{"$f":"IFERROR(INDEX(C$2:C$344,SMALL(IF(B$2:B$344=\"In\",ROW(C$2:C$344)-ROW(C$2)+1),ROW(C151))),\"\")","v":""}]
[null,{"$f":"IF(Conversions!P179=TRUE,\"In\",\"Out\")","v":"Out"},{"$f":"Conversions!S179","v":""},null,{"$f":"IFERROR(INDEX(C$2:C$344,SMALL(IF(B$2:B$344=\"In\",ROW(C$2:C$344)-ROW(C$2)+1),ROW(C152))),\"\")","v":""}]
[null,{"$f":"IF(Conversions!P180=TRUE,\"In\",\"Out\")","v":"Out"},{"$f":"Conversions!S180","v":""},null,{"$f":"IFERROR(INDEX(C$2:C$344,SMALL(IF(B$2:B$344=\"In\",ROW(C$2:C$344)-ROW(C$2)+1),ROW(C153))),\"\")","v":""}]
[null,{"$f":"IF(Conversions!P181=TRUE,\"In\",\"Out\")","v":"Out"},{"$f":"Conversions!S181","v":""},null,{"$f":"IFERROR(INDEX(C$2:C$344,SMALL(IF(B$2:B$344=\"In\",ROW(C$2:C$344)-ROW(C$2)+1),ROW(C154))),\"\")","v":""}]
[null,{"$f":"IF(Conversions!P182=TRUE,\"In\",\"Out\")","v":"Out"},{"$f":"Conversions!S182","v":""},null,{"$f":"IFERROR(INDEX(C$2:C$344,SMALL(IF(B$2:B$344=\"In\",ROW(C$2:C$344)-ROW(C$2)+1),ROW(C155))),\"\")","v":""}]
[null,{"$f":"IF(Conversions!P183=TRUE,\"In\",\"Out\")","v":"Out"},{"$f":"Conversions!S183","v":""},null,{"$f":"IFERROR(INDEX(C$2:C$344,SMALL(IF(B$2:B$344=\"In\",ROW(C$2:C$344)-ROW(C$2)+1),ROW(C156))),\"\")","v":""}]
[null,{"$f":"IF(Conversions!P184=TRUE,\"In\",\"Out\")","v":"Out"},{"$f":"Conversions!S184","v":""},null,{"$f":"IFERROR(INDEX(C$2:C$344,SMALL(IF(B$2:B$344=\"In\",ROW(C$2:C$344)-ROW(C$2)+1),ROW(C157))),\"\")","v":""}]
[null,{"$f":"IF(Conversions!P185=TRUE,\"In\",\"Out\")","v":"Out"},{"$f":"Conversions!S185","v":""},null,{"$f":"IFERROR(INDEX(C$2:C$344,SMALL(IF(B$2:B$344=\"In\",ROW(C$2:C$344)-ROW(C$2)+1),ROW(C158))),\"\")","v":""}]
[null,{"$f":"IF(Conversions!P186=TRUE,\"In\",\"Out\")","v":"Out"},{"$f":"Conversions!S186","v":""},null,{"$f":"IFERROR(INDEX(C$2:C$344,SMALL(IF(B$2:B$344=\"In\",ROW(C$2:C$344)-ROW(C$2)+1),ROW(C159))),\"\")","v":""}]
[null,{"$f":"IF(Conversions!P187=TRUE,\"In\",\"Out\")","v":"Out"},{"$f":"Conversions!S187","v":""},null,{"$f":"IFERROR(INDEX(C$2:C$344,SMALL(IF(B$2:B$344=\"In\",ROW(C$2:C$344)-ROW(C$2)+1),ROW(C160))),\"\")","v":""}]
[null,{"$f":"IF(Conversions!P188=TRUE,\"In\",\"Out\")","v":"Out"},{"$f":"Conversions!S188","v":""},null,{"$f":"IFERROR(INDEX(C$2:C$344,SMALL(IF(B$2:B$344=\"In\",ROW(C$2:C$344)-ROW(C$2)+1),ROW(C161))),\"\")","v":""}]
[null,{"$f":"IF(Conversions!P189=TRUE,\"In\",\"Out\")","v":"Out"},{"$f":"Conversions!S189","v":""},null,{"$f":"IFERROR(INDEX(C$2:C$344,SMALL(IF(B$2:B$344=\"In\",ROW(C$2:C$344)-ROW(C$2)+1),ROW(C162))),\"\")","v":""}]
[null,{"$f":"IF(Conversions!P190=TRUE,\"In\",\"Out\")","v":"Out"},{"$f":"Conversions!S190","v":""},null,{"$f":"IFERROR(INDEX(C$2:C$344,SMALL(IF(B$2:B$344=\"In\",ROW(C$2:C$344)-ROW(C$2)+1),ROW(C163))),\"\")","v":""}]
[null,{"$f":"IF(Conversions!P191=TRUE,\"In\",\"Out\")","v":"Out"},{"$f":"Conversions!S191","v":""},null,{"$f":"IFERROR(INDEX(C$2:C$344,SMALL(IF(B$2:B$344=\"In\",ROW(C$2:C$344)-ROW(C$2)+1),ROW(C164))),\"\")","v":""}]
[null,{"$f":"IF(Conversions!P192=TRUE,\"In\",\"Out\")","v":"Out"},{"$f":"Conversions!S192","v":""},null,{"$f":"IFERROR(INDEX(C$2:C$344,SMALL(IF(B$2:B$344=\"In\",ROW(C$2:C$344)-ROW(C$2)+1),ROW(C165))),\"\")","v":""}]
[null,{"$f":"IF(Conversions!P193=TRUE,\"In\",\"Out\")","v":"Out"},{"$f":"Conversions!S193","v":""},null,{"$f":"IFERROR(INDEX(C$2:C$344,SMALL(IF(B$2:B$344=\"In\",ROW(C$2:C$344)-ROW(C$2)+1),ROW(C166))),\"\")","v":""}]
[null,{"$f":"IF(Conversions!P194=TRUE,\"In\",\"Out\")","v":"Out"},{"$f":"Conversions!S194","v":""},null,{"$f":"IFERROR(INDEX(C$2:C$344,SMALL(IF(B$2:B$344=\"In\",ROW(C$2:C$344)-ROW(C$2)+1),ROW(C167))),\"\")","v":""}]
[null,{"$f":"IF(Conversions!P195=TRUE,\"In\",\"Out\")","v":"Out"},{"$f":"Conversions!S195","v":""},null,{"$f":"IFERROR(INDEX(C$2:C$344,SMALL(IF(B$2:B$344=\"In\",ROW(C$2:C$344)-ROW(C$2)+1),ROW(C168))),\"\")","v":""}]
[null,{"$f":"IF(Conversions!P196=TRUE,\"In\",\"Out\")","v":"Out"},{"$f":"Conversions!S196","v":""},null,{"$f":"IFERROR(INDEX(C$2:C$344,SMALL(IF(B$2:B$344=\"In\",ROW(C$2:C$344)-ROW(C$2)+1),ROW(C169))),\"\")","v":""}]
[null,{"$f":"IF(Conversions!P197=TRUE,\"In\",\"Out\")","v":"Out"},{"$f":"Conversions!S197","v":""},null,{"$f":"IFERROR(INDEX(C$2:C$344,SMALL(IF(B$2:B$344=\"In\",ROW(C$2:C$344)-ROW(C$2)+1),ROW(C170))),\"\")","v":""}]
[null,{"$f":"IF(Conversions!P198=TRUE,\"In\",\"Out\")","v":"Out"},{"$f":"Conversions!S198","v":""},null,{"$f":"IFERROR(INDEX(C$2:C$344,SMALL(IF(B$2:B$344=\"In\",ROW(C$2:C$344)-ROW(C$2)+1),ROW(C171))),\"\")","v":""}]
[null,{"$f":"IF(Conversions!P199=TRUE,\"In\",\"Out\")","v":"Out"},{"$f":"Conversions!S199","v":""},null,{"$f":"IFERROR(INDEX(C$2:C$344,SMALL(IF(B$2:B$344=\"In\",ROW(C$2:C$344)-ROW(C$2)+1),ROW(C172))),\"\")","v":""}]
[null,{"$f":"IF(Conversions!P200=TRUE,\"In\",\"Out\")","v":"Out"},{"$f":"Conversions!S200","v":""},null,{"$f":"IFERROR(INDEX(C$2:C$344,SMALL(IF(B$2:B$344=\"In\",ROW(C$2:C$344)-ROW(C$2)+1),ROW(C173))),\"\")","v":""}]
[null,{"$f":"IF(Conversions!P201=TRUE,\"In\",\"Out\")","v":"Out"},{"$f":"Conversions!S201","v":""},null,{"$f":"IFERROR(INDEX(C$2:C$344,SMALL(IF(B$2:B$344=\"In\",ROW(C$2:C$344)-ROW(C$2)+1),ROW(C174))),\"\")","v":""}]
[null,{"$f":"IF(Conversions!P202=TRUE,\"In\",\"Out\")","v":"Out"},{"$f":"Conversions!S202","v":""},null,{"$f":"IFERROR(INDEX(C$2:C$344,SMALL(IF(B$2:B$344=\"In\",ROW(C$2:C$344)-ROW(C$2)+1),ROW(C175))),\"\")","v":""}]
[null,{"$f":"IF(Conversions!P203=TRUE,\"In\",\"Out\")","v":"Out"},{"$f":"Conversions!S203","v":""},null,{"$f":"IFERROR(INDEX(C$2:C$344,SMALL(IF(B$2:B$344=\"In\",ROW(C$2:C$344)-ROW(C$2)+1),ROW(C176))),\"\")","v":""}]
[null,{"$f":"IF(Conversions!P204=TRUE,\"In\",\"Out\")","v":"Out"},{"$f":"Conversions!S204","v":""},null,{"$f":"IFERROR(INDEX(C$2:C$344,SMALL(IF(B$2:B$344=\"In\",ROW(C$2:C$344)-ROW(C$2)+1),ROW(C177))),\"\")","v":""}]
[null,{"$f":"IF(Conversions!P205=TRUE,\"In\",\"Out\")","v":"Out"},{"$f":"Conversions!S205","v":""},null,{"$f":"IFERROR(INDEX(C$2:C$344,SMALL(IF(B$2:B$344=\"In\",ROW(C$2:C$344)-ROW(C$2)+1),ROW(C178))),\"\")","v":""}]
[null,{"$f":"IF(Conversions!P206=TRUE,\"In\",\"Out\")","v":"Out"},{"$f":"Conversions!S206","v":""},null,{"$f":"IFERROR(INDEX(C$2:C$344,SMALL(IF(B$2:B$344=\"In\",ROW(C$2:C$344)-ROW(C$2)+1),ROW(C179))),\"\")","v":""}]
[null,{"$f":"IF(Conversions!P207=TRUE,\"In\",\"Out\")","v":"Out"},{"$f":"Conversions!S207","v":""},null,{"$f":"IFERROR(INDEX(C$2:C$344,SMALL(IF(B$2:B$344=\"In\",ROW(C$2:C$344)-ROW(C$2)+1),ROW(C180))),\"\")","v":""}]
[null,{"$f":"IF(Conversions!P208=TRUE,\"In\",\"Out\")","v":"Out"},{"$f":"Conversions!S208","v":""},null,{"$f":"IFERROR(INDEX(C$2:C$344,SMALL(IF(B$2:B$344=\"In\",ROW(C$2:C$344)-ROW(C$2)+1),ROW(C181))),\"\")","v":""}]
[null,{"$f":"IF(Conversions!P209=TRUE,\"In\",\"Out\")","v":"Out"},{"$f":"Conversions!S209","v":""},null,{"$f":"IFERROR(INDEX(C$2:C$344,SMALL(IF(B$2:B$344=\"In\",ROW(C$2:C$344)-ROW(C$2)+1),ROW(C182))),\"\")","v":""}]
[null,{"$f":"IF(Conversions!P210=TRUE,\"In\",\"Out\")","v":"Out"},{"$f":"Conversions!S210","v":""},null,{"$f":"IFERROR(INDEX(C$2:C$344,SMALL(IF(B$2:B$344=\"In\",ROW(C$2:C$344)-ROW(C$2)+1),ROW(C183))),\"\")","v":""}]
[null,{"$f":"IF(Conversions!P211=TRUE,\"In\",\"Out\")","v":"Out"},{"$f":"Conversions!S211","v":""},null,{"$f":"IFERROR(INDEX(C$2:C$344,SMALL(IF(B$2:B$344=\"In\",ROW(C$2:C$344)-ROW(C$2)+1),ROW(C184))),\"\")","v":""}]
[null,{"$f":"IF(Conversions!P212=TRUE,\"In\",\"Out\")","v":"Out"},{"$f":"Conversions!S212","v":""},null,{"$f":"IFERROR(INDEX(C$2:C$344,SMALL(IF(B$2:B$344=\"In\",ROW(C$2:C$344)-ROW(C$2)+1),ROW(C185))),\"\")","v":""}]
[null,{"$f":"IF(Conversions!P213=TRUE,\"In\",\"Out\")","v":"Out"},{"$f":"Conversions!S213","v":""},null,{"$f":"IFERROR(INDEX(C$2:C$344,SMALL(IF(B$2:B$344=\"In\",ROW(C$2:C$344)-ROW(C$2)+1),ROW(C186))),\"\")","v":""}]
[null,{"$f":"IF(Conversions!P214=TRUE,\"In\",\"Out\")","v":"Out"},{"$f":"Conversions!S214","v":""},null,{"$f":"IFERROR(INDEX(C$2:C$344,SMALL(IF(B$2:B$344=\"In\",ROW(C$2:C$344)-ROW(C$2)+1),ROW(C187))),\"\")","v":""}]
[null,{"$f":"IF(Conversions!P215=TRUE,\"In\",\"Out\")","v":"Out"},{"$f":"Conversions!S215","v":""},null,{"$f":"IFERROR(INDEX(C$2:C$344,SMALL(IF(B$2:B$344=\"In\",ROW(C$2:C$344)-ROW(C$2)+1),ROW(C188))),\"\")","v":""}]
[null,{"$f":"IF(Conversions!P216=TRUE,\"In\",\"Out\")","v":"Out"},{"$f":"Conversions!S216","v":""},null,{"$f":"IFERROR(INDEX(C$2:C$344,SMALL(IF(B$2:B$344=\"In\",ROW(C$2:C$344)-ROW(C$2)+1),ROW(C189))),\"\")","v":""}]
[null,{"$f":"IF(Conversions!P217=TRUE,\"In\",\"Out\")","v":"Out"},{"$f":"Conversions!S217","v":""},null,{"$f":"IFERROR(INDEX(C$2:C$344,SMALL(IF(B$2:B$344=\"In\",ROW(C$2:C$344)-ROW(C$2)+1),ROW(C190))),\"\")","v":""}]
[null,{"$f":"IF(Conversions!P218=TRUE,\"In\",\"Out\")","v":"Out"},{"$f":"Conversions!S218","v":""},null,{"$f":"IFERROR(INDEX(C$2:C$344,SMALL(IF(B$2:B$344=\"In\",ROW(C$2:C$344)-ROW(C$2)+1),ROW(C191))),\"\")","v":""}]
[null,{"$f":"IF(Conversions!P219=TRUE,\"In\",\"Out\")","v":"Out"},{"$f":"Conversions!S219","v":""},null,{"$f":"IFERROR(INDEX(C$2:C$344,SMALL(IF(B$2:B$344=\"In\",ROW(C$2:C$344)-ROW(C$2)+1),ROW(C192))),\"\")","v":""}]
[null,{"$f":"IF(Conversions!P220=TRUE,\"In\",\"Out\")","v":"Out"},{"$f":"Conversions!S220","v":""},null,{"$f":"IFERROR(INDEX(C$2:C$344,SMALL(IF(B$2:B$344=\"In\",ROW(C$2:C$344)-ROW(C$2)+1),ROW(C193))),\"\")","v":""}]
[null,{"$f":"IF(Conversions!P221=TRUE,\"In\",\"Out\")","v":"Out"},{"$f":"Conversions!S221","v":""},null,{"$f":"IFERROR(INDEX(C$2:C$344,SMALL(IF(B$2:B$344=\"In\",ROW(C$2:C$344)-ROW(C$2)+1),ROW(C194))),\"\")","v":""}]
[null,{"$f":"IF(Conversions!P222=TRUE,\"In\",\"Out\")","v":"Out"},{"$f":"Conversions!S222","v":""},null,{"$f":"IFERROR(INDEX(C$2:C$344,SMALL(IF(B$2:B$344=\"In\",ROW(C$2:C$344)-ROW(C$2)+1),ROW(C195))),\"\")","v":""}]
[null,{"$f":"IF(Conversions!P223=TRUE,\"In\",\"Out\")","v":"Out"},{"$f":"Conversions!S223","v":""},null,{"$f":"IFERROR(INDEX(C$2:C$344,SMALL(IF(B$2:B$344=\"In\",ROW(C$2:C$344)-ROW(C$2)+1),ROW(C196))),\"\")","v":""}]
[null,{"$f":"IF(Conversions!P224=TRUE,\"In\",\"Out\")","v":"Out"},{"$f":"Conversions!S224","v":""},null,{"$f":"IFERROR(INDEX(C$2:C$344,SMALL(IF(B$2:B$344=\"In\",ROW(C$2:C$344)-ROW(C$2)+1),ROW(C197))),\"\")","v":""}]
[null,{"$f":"IF(Conversions!P225=TRUE,\"In\",\"Out\")","v":"Out"},{"$f":"Conversions!S225","v":""},null,{"$f":"IFERROR(INDEX(C$2:C$344,SMALL(IF(B$2:B$344=\"In\",ROW(C$2:C$344)-ROW(C$2)+1),ROW(C198))),\"\")","v":""}]
[null,{"$f":"IF(Conversions!P226=TRUE,\"In\",\"Out\")","v":"Out"},{"$f":"Conversions!S226","v":""},null,{"$f":"IFERROR(INDEX(C$2:C$344,SMALL(IF(B$2:B$344=\"In\",ROW(C$2:C$344)-ROW(C$2)+1),ROW(C199))),\"\")","v":""}]
[null,{"$f":"IF(Conversions!P227=TRUE,\"In\",\"Out\")","v":"Out"},{"$f":"Conversions!S227","v":""},null,{"$f":"IFERROR(INDEX(C$2:C$344,SMALL(IF(B$2:B$344=\"In\",ROW(C$2:C$344)-ROW(C$2)+1),ROW(C200))),\"\")","v":""}]
[null,{"$f":"IF(Conversions!P228=TRUE,\"In\",\"Out\")","v":"Out"},{"$f":"Conversions!S228","v":""},null,{"$f":"IFERROR(INDEX(C$2:C$344,SMALL(IF(B$2:B$344=\"In\",ROW(C$2:C$344)-ROW(C$2)+1),ROW(C201))),\"\")","v":""}]
[null,{"$f":"IF(Conversions!P229=TRUE,\"In\",\"Out\")","v":"Out"},{"$f":"Conversions!S229","v":""},null,{"$f":"IFERROR(INDEX(C$2:C$344,SMALL(IF(B$2:B$344=\"In\",ROW(C$2:C$344)-ROW(C$2)+1),ROW(C202))),\"\")","v":""}]
[null,{"$f":"IF(Conversions!P230=TRUE,\"In\",\"Out\")","v":"Out"},{"$f":"Conversions!S230","v":""},null,{"$f":"IFERROR(INDEX(C$2:C$344,SMALL(IF(B$2:B$344=\"In\",ROW(C$2:C$344)-ROW(C$2)+1),ROW(C203))),\"\")","v":""}]
[null,{"$f":"IF(Conversions!P231=TRUE,\"In\",\"Out\")","v":"Out"},{"$f":"Conversions!S231","v":""},null,{"$f":"IFERROR(INDEX(C$2:C$344,SMALL(IF(B$2:B$344=\"In\",ROW(C$2:C$344)-ROW(C$2)+1),ROW(C204))),\"\")","v":""}]
[null,{"$f":"IF(Conversions!P232=TRUE,\"In\",\"Out\")","v":"Out"},{"$f":"Conversions!S232","v":""},null,{"$f":"IFERROR(INDEX(C$2:C$344,SMALL(IF(B$2:B$344=\"In\",ROW(C$2:C$344)-ROW(C$2)+1),ROW(C205))),\"\")","v":""}]
[null,{"$f":"IF(Conversions!P233=TRUE,\"In\",\"Out\")","v":"Out"},{"$f":"Conversions!S233","v":""},null,{"$f":"IFERROR(INDEX(C$2:C$344,SMALL(IF(B$2:B$344=\"In\",ROW(C$2:C$344)-ROW(C$2)+1),ROW(C206))),\"\")","v":""}]
[null,{"$f":"IF(Conversions!P234=TRUE,\"In\",\"Out\")","v":"Out"},{"$f":"Conversions!S234","v":""},null,{"$f":"IFERROR(INDEX(C$2:C$344,SMALL(IF(B$2:B$344=\"In\",ROW(C$2:C$344)-ROW(C$2)+1),ROW(C207))),\"\")","v":""}]
[null,{"$f":"IF(Conversions!P235=TRUE,\"In\",\"Out\")","v":"Out"},{"$f":"Conversions!S235","v":""},null,{"$f":"IFERROR(INDEX(C$2:C$344,SMALL(IF(B$2:B$344=\"In\",ROW(C$2:C$344)-ROW(C$2)+1),ROW(C208))),\"\")","v":""}]
[null,{"$f":"IF(Conversions!P236=TRUE,\"In\",\"Out\")","v":"Out"},{"$f":"Conversions!S236","v":""},null,{"$f":"IFERROR(INDEX(C$2:C$344,SMALL(IF(B$2:B$344=\"In\",ROW(C$2:C$344)-ROW(C$2)+1),ROW(C209))),\"\")","v":""}]
[null,{"$f":"IF(Conversions!P237=TRUE,\"In\",\"Out\")","v":"Out"},{"$f":"Conversions!S237","v":""},null,{"$f":"IFERROR(INDEX(C$2:C$344,SMALL(IF(B$2:B$344=\"In\",ROW(C$2:C$344)-ROW(C$2)+1),ROW(C210))),\"\")","v":""}]
[null,{"$f":"IF(Conversions!P238=TRUE,\"In\",\"Out\")","v":"Out"},{"$f":"Conversions!S238","v":""},null,{"$f":"IFERROR(INDEX(C$2:C$344,SMALL(IF(B$2:B$344=\"In\",ROW(C$2:C$344)-ROW(C$2)+1),ROW(C211))),\"\")","v":""}]
[null,{"$f":"IF(Conversions!P239=TRUE,\"In\",\"Out\")","v":"Out"},{"$f":"Conversions!S239","v":""},null,{"$f":"IFERROR(INDEX(C$2:C$344,SMALL(IF(B$2:B$344=\"In\",ROW(C$2:C$344)-ROW(C$2)+1),ROW(C212))),\"\")","v":""}]
[null,{"$f":"IF(Conversions!P240=TRUE,\"In\",\"Out\")","v":"Out"},{"$f":"Conversions!S240","v":""},null,{"$f":"IFERROR(INDEX(C$2:C$344,SMALL(IF(B$2:B$344=\"In\",ROW(C$2:C$344)-ROW(C$2)+1),ROW(C213))),\"\")","v":""}]
[null,{"$f":"IF(Conversions!P241=TRUE,\"In\",\"Out\")","v":"Out"},{"$f":"Conversions!S241","v":""},null,{"$f":"IFERROR(INDEX(C$2:C$344,SMALL(IF(B$2:B$344=\"In\",ROW(C$2:C$344)-ROW(C$2)+1),ROW(C214))),\"\")","v":""}]
[null,{"$f":"IF(Conversions!P242=TRUE,\"In\",\"Out\")","v":"Out"},{"$f":"Conversions!S242","v":""},null,{"$f":"IFERROR(INDEX(C$2:C$344,SMALL(IF(B$2:B$344=\"In\",ROW(C$2:C$344)-ROW(C$2)+1),ROW(C215))),\"\")","v":""}]
[null,{"$f":"IF(Conversions!P243=TRUE,\"In\",\"Out\")","v":"Out"},{"$f":"Conversions!S243","v":""},null,{"$f":"IFERROR(INDEX(C$2:C$344,SMALL(IF(B$2:B$344=\"In\",ROW(C$2:C$344)-ROW(C$2)+1),ROW(C216))),\"\")","v":""}]
[null,{"$f":"IF(Conversions!P244=TRUE,\"In\",\"Out\")","v":"Out"},{"$f":"Conversions!S244","v":""},null,{"$f":"IFERROR(INDEX(C$2:C$344,SMALL(IF(B$2:B$344=\"In\",ROW(C$2:C$344)-ROW(C$2)+1),ROW(C217))),\"\")","v":""}]
[null,{"$f":"IF(Conversions!P245=TRUE,\"In\",\"Out\")","v":"Out"},{"$f":"Conversions!S245","v":""},null,{"$f":"IFERROR(INDEX(C$2:C$344,SMALL(IF(B$2:B$344=\"In\",ROW(C$2:C$344)-ROW(C$2)+1),ROW(C218))),\"\")","v":""}]
[null,{"$f":"IF(Conversions!P246=TRUE,\"In\",\"Out\")","v":"Out"},{"$f":"Conversions!S246","v":""},null,{"$f":"IFERROR(INDEX(C$2:C$344,SMALL(IF(B$2:B$344=\"In\",ROW(C$2:C$344)-ROW(C$2)+1),ROW(C219))),\"\")","v":""}]
[null,{"$f":"IF(Conversions!P247=TRUE,\"In\",\"Out\")","v":"Out"},{"$f":"Conversions!S247","v":""},null,{"$f":"IFERROR(INDEX(C$2:C$344,SMALL(IF(B$2:B$344=\"In\",ROW(C$2:C$344)-ROW(C$2)+1),ROW(C220))),\"\")","v":""}]
[null,{"$f":"IF(Conversions!P248=TRUE,\"In\",\"Out\")","v":"Out"},{"$f":"Conversions!S248","v":""},null,{"$f":"IFERROR(INDEX(C$2:C$344,SMALL(IF(B$2:B$344=\"In\",ROW(C$2:C$344)-ROW(C$2)+1),ROW(C221))),\"\")","v":""}]
[null,{"$f":"IF(Conversions!P249=TRUE,\"In\",\"Out\")","v":"Out"},{"$f":"Conversions!S249","v":""},null,{"$f":"IFERROR(INDEX(C$2:C$344,SMALL(IF(B$2:B$344=\"In\",ROW(C$2:C$344)-ROW(C$2)+1),ROW(C222))),\"\")","v":""}]
[null,{"$f":"IF(Conversions!P250=TRUE,\"In\",\"Out\")","v":"Out"},{"$f":"Conversions!S250","v":""},null,{"$f":"IFERROR(INDEX(C$2:C$344,SMALL(IF(B$2:B$344=\"In\",ROW(C$2:C$344)-ROW(C$2)+1),ROW(C223))),\"\")","v":""}]
[null,{"$f":"IF(Conversions!P251=TRUE,\"In\",\"Out\")","v":"Out"},{"$f":"Conversions!S251","v":""},null,{"$f":"IFERROR(INDEX(C$2:C$344,SMALL(IF(B$2:B$344=\"In\",ROW(C$2:C$344)-ROW(C$2)+1),ROW(C224))),\"\")","v":""}]
[null,{"$f":"IF(Conversions!P252=TRUE,\"In\",\"Out\")","v":"Out"},{"$f":"Conversions!S252","v":""},null,{"$f":"IFERROR(INDEX(C$2:C$344,SMALL(IF(B$2:B$344=\"In\",ROW(C$2:C$344)-ROW(C$2)+1),ROW(C225))),\"\")","v":""}]
[null,{"$f":"IF(Conversions!P253=TRUE,\"In\",\"Out\")","v":"Out"},{"$f":"Conversions!S253","v":""},null,{"$f":"IFERROR(INDEX(C$2:C$344,SMALL(IF(B$2:B$344=\"In\",ROW(C$2:C$344)-ROW(C$2)+1),ROW(C226))),\"\")","v":""}]
[null,{"$f":"IF(Conversions!P254=TRUE,\"In\",\"Out\")","v":"Out"},{"$f":"Conversions!S254","v":""},null,{"$f":"IFERROR(INDEX(C$2:C$344,SMALL(IF(B$2:B$344=\"In\",ROW(C$2:C$344)-ROW(C$2)+1),ROW(C227))),\"\")","v":""}]
[null,{"$f":"IF(Conversions!P255=TRUE,\"In\",\"Out\")","v":"Out"},{"$f":"Conversions!S255","v":""},null,{"$f":"IFERROR(INDEX(C$2:C$344,SMALL(IF(B$2:B$344=\"In\",ROW(C$2:C$344)-ROW(C$2)+1),ROW(C228))),\"\")","v":""}]
[null,{"$f":"IF(Conversions!P256=TRUE,\"In\",\"Out\")","v":"Out"},{"$f":"Conversions!S256","v":""},null,{"$f":"IFERROR(INDEX(C$2:C$344,SMALL(IF(B$2:B$344=\"In\",ROW(C$2:C$344)-ROW(C$2)+1),ROW(C229))),\"\")","v":""}]
[null,{"$f":"IF(Conversions!P257=TRUE,\"In\",\"Out\")","v":"Out"},{"$f":"Conversions!S257","v":""},null,{"$f":"IFERROR(INDEX(C$2:C$344,SMALL(IF(B$2:B$344=\"In\",ROW(C$2:C$344)-ROW(C$2)+1),ROW(C230))),\"\")","v":""}]
[null,{"$f":"IF(Conversions!P258=TRUE,\"In\",\"Out\")","v":"Out"},{"$f":"Conversions!S258","v":""},null,{"$f":"IFERROR(INDEX(C$2:C$344,SMALL(IF(B$2:B$344=\"In\",ROW(C$2:C$344)-ROW(C$2)+1),ROW(C231))),\"\")","v":""}]
[null,{"$f":"IF(Conversions!P259=TRUE,\"In\",\"Out\")","v":"Out"},{"$f":"Conversions!S259","v":""},null,{"$f":"IFERROR(INDEX(C$2:C$344,SMALL(IF(B$2:B$344=\"In\",ROW(C$2:C$344)-ROW(C$2)+1),ROW(C232))),\"\")","v":""}]
[null,{"$f":"IF(Conversions!P260=TRUE,\"In\",\"Out\")","v":"Out"},{"$f":"Conversions!S260","v":""},null,{"$f":"IFERROR(INDEX(C$2:C$344,SMALL(IF(B$2:B$344=\"In\",ROW(C$2:C$344)-ROW(C$2)+1),ROW(C233))),\"\")","v":""}]
[null,{"$f":"IF(Conversions!P261=TRUE,\"In\",\"Out\")","v":"Out"},{"$f":"Conversions!S261","v":""},null,{"$f":"IFERROR(INDEX(C$2:C$344,SMALL(IF(B$2:B$344=\"In\",ROW(C$2:C$344)-ROW(C$2)+1),ROW(C234))),\"\")","v":""}]
[null,{"$f":"IF(Conversions!P262=TRUE,\"In\",\"Out\")","v":"Out"},{"$f":"Conversions!S262","v":""},null,{"$f":"IFERROR(INDEX(C$2:C$344,SMALL(IF(B$2:B$344=\"In\",ROW(C$2:C$344)-ROW(C$2)+1),ROW(C235))),\"\")","v":""}]
[null,{"$f":"IF(Conversions!P263=TRUE,\"In\",\"Out\")","v":"Out"},{"$f":"Conversions!S263","v":"\""},null,{"$f":"IFERROR(INDEX(C$2:C$344,SMALL(IF(B$2:B$344=\"In\",ROW(C$2:C$344)-ROW(C$2)+1),ROW(C236))),\"\")","v":""}]
[null,{"$f":"IF(Conversions!P264=TRUE,\"In\",\"Out\")","v":"Out"},{"$f":"Conversions!S264","v":0},null,{"$f":"IFERROR(INDEX(C$2:C$344,SMALL(IF(B$2:B$344=\"In\",ROW(C$2:C$344)-ROW(C$2)+1),ROW(C237))),\"\")","v":""}]
[null,{"$f":"IF(Conversions!P265=TRUE,\"In\",\"Out\")","v":"Out"},{"$f":"Conversions!S265","v":0},null,{"$f":"IFERROR(INDEX(C$2:C$344,SMALL(IF(B$2:B$344=\"In\",ROW(C$2:C$344)-ROW(C$2)+1),ROW(C238))),\"\")","v":""}]
[null,{"$f":"IF(Conversions!P266=TRUE,\"In\",\"Out\")","v":"Out"},{"$f":"Conversions!S266","v":0},null,{"$f":"IFERROR(INDEX(C$2:C$344,SMALL(IF(B$2:B$344=\"In\",ROW(C$2:C$344)-ROW(C$2)+1),ROW(C239))),\"\")","v":""}]
[null,{"$f":"IF(Conversions!P267=TRUE,\"In\",\"Out\")","v":"Out"},{"$f":"Conversions!S267","v":""},null,{"$f":"IFERROR(INDEX(C$2:C$344,SMALL(IF(B$2:B$344=\"In\",ROW(C$2:C$344)-ROW(C$2)+1),ROW(C240))),\"\")","v":""}]
[null,{"$f":"IF(Conversions!P268=TRUE,\"In\",\"Out\")","v":"Out"},{"$f":"Conversions!S268","v":""},null,{"$f":"IFERROR(INDEX(C$2:C$344,SMALL(IF(B$2:B$344=\"In\",ROW(C$2:C$344)-ROW(C$2)+1),ROW(C241))),\"\")","v":""}]
[null,{"$f":"IF(Conversions!P269=TRUE,\"In\",\"Out\")","v":"Out"},{"$f":"Conversions!S269","v":""},null,{"$f":"IFERROR(INDEX(C$2:C$344,SMALL(IF(B$2:B$344=\"In\",ROW(C$2:C$344)-ROW(C$2)+1),ROW(C242))),\"\")","v":""}]
[null,{"$f":"IF(Conversions!P270=TRUE,\"In\",\"Out\")","v":"Out"},{"$f":"Conversions!S270","v":""},null,{"$f":"IFERROR(INDEX(C$2:C$344,SMALL(IF(B$2:B$344=\"In\",ROW(C$2:C$344)-ROW(C$2)+1),ROW(C243))),\"\")","v":""}]
[null,{"$f":"IF(Conversions!P271=TRUE,\"In\",\"Out\")","v":"Out"},{"$f":"Conversions!S271","v":""},null,{"$f":"IFERROR(INDEX(C$2:C$344,SMALL(IF(B$2:B$344=\"In\",ROW(C$2:C$344)-ROW(C$2)+1),ROW(C244))),\"\")","v":""}]
[null,{"$f":"IF(Conversions!P272=TRUE,\"In\",\"Out\")","v":"Out"},{"$f":"Conversions!S272","v":""},null,{"$f":"IFERROR(INDEX(C$2:C$344,SMALL(IF(B$2:B$344=\"In\",ROW(C$2:C$344)-ROW(C$2)+1),ROW(C245))),\"\")","v":""}]
[null,{"$f":"IF(Conversions!P273=TRUE,\"In\",\"Out\")","v":"Out"},{"$f":"Conversions!S273","v":""},null,{"$f":"IFERROR(INDEX(C$2:C$344,SMALL(IF(B$2:B$344=\"In\",ROW(C$2:C$344)-ROW(C$2)+1),ROW(C246))),\"\")","v":""}]
[null,{"$f":"IF(Conversions!P274=TRUE,\"In\",\"Out\")","v":"Out"},{"$f":"Conversions!S274","v":""},null,{"$f":"IFERROR(INDEX(C$2:C$344,SMALL(IF(B$2:B$344=\"In\",ROW(C$2:C$344)-ROW(C$2)+1),ROW(C247))),\"\")","v":""}]
[null,{"$f":"IF(Conversions!P275=TRUE,\"In\",\"Out\")","v":"Out"},{"$f":"Conversions!S275","v":""},null,{"$f":"IFERROR(INDEX(C$2:C$344,SMALL(IF(B$2:B$344=\"In\",ROW(C$2:C$344)-ROW(C$2)+1),ROW(C248))),\"\")","v":""}]
[null,{"$f":"IF(Conversions!P276=TRUE,\"In\",\"Out\")","v":"Out"},{"$f":"Conversions!S276","v":""},null,{"$f":"IFERROR(INDEX(C$2:C$344,SMALL(IF(B$2:B$344=\"In\",ROW(C$2:C$344)-ROW(C$2)+1),ROW(C249))),\"\")","v":""}]
[null,{"$f":"IF(Conversions!P277=TRUE,\"In\",\"Out\")","v":"Out"},{"$f":"Conversions!S277","v":""},null,{"$f":"IFERROR(INDEX(C$2:C$344,SMALL(IF(B$2:B$344=\"In\",ROW(C$2:C$344)-ROW(C$2)+1),ROW(C250))),\"\")","v":""}]
[null,{"$f":"IF(Conversions!P278=TRUE,\"In\",\"Out\")","v":"Out"},{"$f":"Conversions!S278","v":""},null,{"$f":"IFERROR(INDEX(C$2:C$344,SMALL(IF(B$2:B$344=\"In\",ROW(C$2:C$344)-ROW(C$2)+1),ROW(C251))),\"\")","v":""}]
[null,{"$f":"IF(Conversions!P279=TRUE,\"In\",\"Out\")","v":"Out"},{"$f":"Conversions!S279","v":""},null,{"$f":"IFERROR(INDEX(C$2:C$344,SMALL(IF(B$2:B$344=\"In\",ROW(C$2:C$344)-ROW(C$2)+1),ROW(C252))),\"\")","v":""}]
[null,{"$f":"IF(Conversions!P280=TRUE,\"In\",\"Out\")","v":"Out"},{"$f":"Conversions!S280","v":""},null,{"$f":"IFERROR(INDEX(C$2:C$344,SMALL(IF(B$2:B$344=\"In\",ROW(C$2:C$344)-ROW(C$2)+1),ROW(C253))),\"\")","v":""}]
[null,{"$f":"IF(Conversions!P281=TRUE,\"In\",\"Out\")","v":"Out"},{"$f":"Conversions!S281","v":""},null,{"$f":"IFERROR(INDEX(C$2:C$344,SMALL(IF(B$2:B$344=\"In\",ROW(C$2:C$344)-ROW(C$2)+1),ROW(C254))),\"\")","v":""}]
[null,{"$f":"IF(Conversions!P282=TRUE,\"In\",\"Out\")","v":"Out"},{"$f":"Conversions!S282","v":""},null,{"$f":"IFERROR(INDEX(C$2:C$344,SMALL(IF(B$2:B$344=\"In\",ROW(C$2:C$344)-ROW(C$2)+1),ROW(C255))),\"\")","v":""}]
[null,{"$f":"IF(Conversions!P283=TRUE,\"In\",\"Out\")","v":"Out"},{"$f":"Conversions!S283","v":""},null,{"$f":"IFERROR(INDEX(C$2:C$344,SMALL(IF(B$2:B$344=\"In\",ROW(C$2:C$344)-ROW(C$2)+1),ROW(C256))),\"\")","v":""}]
[null,{"$f":"IF(Conversions!P284=TRUE,\"In\",\"Out\")","v":"Out"},{"$f":"Conversions!S284","v":""},null,{"$f":"IFERROR(INDEX(C$2:C$344,SMALL(IF(B$2:B$344=\"In\",ROW(C$2:C$344)-ROW(C$2)+1),ROW(C257))),\"\")","v":""}]
[null,{"$f":"IF(Conversions!P285=TRUE,\"In\",\"Out\")","v":"Out"},{"$f":"Conversions!S285","v":""},null,{"$f":"IFERROR(INDEX(C$2:C$344,SMALL(IF(B$2:B$344=\"In\",ROW(C$2:C$344)-ROW(C$2)+1),ROW(C258))),\"\")","v":""}]
[null,{"$f":"IF(Conversions!P286=TRUE,\"In\",\"Out\")","v":"Out"},{"$f":"Conversions!S286","v":""},null,{"$f":"IFERROR(INDEX(C$2:C$344,SMALL(IF(B$2:B$344=\"In\",ROW(C$2:C$344)-ROW(C$2)+1),ROW(C259))),\"\")","v":""}]
[null,{"$f":"IF(Conversions!P287=TRUE,\"In\",\"Out\")","v":"Out"},{"$f":"Conversions!S287","v":""},null,{"$f":"IFERROR(INDEX(C$2:C$344,SMALL(IF(B$2:B$344=\"In\",ROW(C$2:C$344)-ROW(C$2)+1),ROW(C260))),\"\")","v":""}]
[null,{"$f":"IF(Conversions!P288=TRUE,\"In\",\"Out\")","v":"Out"},{"$f":"Conversions!S288","v":""},null,{"$f":"IFERROR(INDEX(C$2:C$344,SMALL(IF(B$2:B$344=\"In\",ROW(C$2:C$344)-ROW(C$2)+1),ROW(C261))),\"\")","v":""}]
[null,{"$f":"IF(Conversions!P289=TRUE,\"In\",\"Out\")","v":"Out"},{"$f":"Conversions!S289","v":""},null,{"$f":"IFERROR(INDEX(C$2:C$344,SMALL(IF(B$2:B$344=\"In\",ROW(C$2:C$344)-ROW(C$2)+1),ROW(C262))),\"\")","v":""}]
[null,{"$f":"IF(Conversions!P290=TRUE,\"In\",\"Out\")","v":"Out"},{"$f":"Conversions!S290","v":""},null,{"$f":"IFERROR(INDEX(C$2:C$344,SMALL(IF(B$2:B$344=\"In\",ROW(C$2:C$344)-ROW(C$2)+1),ROW(C263))),\"\")","v":""}]
[null,{"$f":"IF(Conversions!P291=TRUE,\"In\",\"Out\")","v":"Out"},{"$f":"Conversions!S291","v":""},null,{"$f":"IFERROR(INDEX(C$2:C$344,SMALL(IF(B$2:B$344=\"In\",ROW(C$2:C$344)-ROW(C$2)+1),ROW(C264))),\"\")","v":""}]
[null,{"$f":"IF(Conversions!P292=TRUE,\"In\",\"Out\")","v":"Out"},{"$f":"Conversions!S292","v":""},null,{"$f":"IFERROR(INDEX(C$2:C$344,SMALL(IF(B$2:B$344=\"In\",ROW(C$2:C$344)-ROW(C$2)+1),ROW(C265))),\"\")","v":""}]
[null,{"$f":"IF(Conversions!P293=TRUE,\"In\",\"Out\")","v":"Out"},{"$f":"Conversions!S293","v":""},null,{"$f":"IFERROR(INDEX(C$2:C$344,SMALL(IF(B$2:B$344=\"In\",ROW(C$2:C$344)-ROW(C$2)+1),ROW(C266))),\"\")","v":""}]
[null,{"$f":"IF(Conversions!P294=TRUE,\"In\",\"Out\")","v":"Out"},{"$f":"Conversions!S294","v":""},null,{"$f":"IFERROR(INDEX(C$2:C$344,SMALL(IF(B$2:B$344=\"In\",ROW(C$2:C$344)-ROW(C$2)+1),ROW(C267))),\"\")","v":""}]
[null,{"$f":"IF(Conversions!P295=TRUE,\"In\",\"Out\")","v":"Out"},{"$f":"Conversions!S295","v":""},null,{"$f":"IFERROR(INDEX(C$2:C$344,SMALL(IF(B$2:B$344=\"In\",ROW(C$2:C$344)-ROW(C$2)+1),ROW(C268))),\"\")","v":""}]
[null,{"$f":"IF(Conversions!P296=TRUE,\"In\",\"Out\")","v":"Out"},{"$f":"Conversions!S296","v":""},null,{"$f":"IFERROR(INDEX(C$2:C$344,SMALL(IF(B$2:B$344=\"In\",ROW(C$2:C$344)-ROW(C$2)+1),ROW(C269))),\"\")","v":""}]
[null,{"$f":"IF(Conversions!P297=TRUE,\"In\",\"Out\")","v":"Out"},{"$f":"Conversions!S297","v":""},null,{"$f":"IFERROR(INDEX(C$2:C$344,SMALL(IF(B$2:B$344=\"In\",ROW(C$2:C$344)-ROW(C$2)+1),ROW(C270))),\"\")","v":""}]
[null,{"$f":"IF(Conversions!P298=TRUE,\"In\",\"Out\")","v":"Out"},{"$f":"Conversions!S298","v":""},null,{"$f":"IFERROR(INDEX(C$2:C$344,SMALL(IF(B$2:B$344=\"In\",ROW(C$2:C$344)-ROW(C$2)+1),ROW(C271))),\"\")","v":""}]
[null,{"$f":"IF(Conversions!P299=TRUE,\"In\",\"Out\")","v":"Out"},{"$f":"Conversions!S299","v":""},null,{"$f":"IFERROR(INDEX(C$2:C$344,SMALL(IF(B$2:B$344=\"In\",ROW(C$2:C$344)-ROW(C$2)+1),ROW(C272))),\"\")","v":""}]
[null,{"$f":"IF(Conversions!P300=TRUE,\"In\",\"Out\")","v":"Out"},{"$f":"Conversions!S300","v":""},null,{"$f":"IFERROR(INDEX(C$2:C$344,SMALL(IF(B$2:B$344=\"In\",ROW(C$2:C$344)-ROW(C$2)+1),ROW(C273))),\"\")","v":""}]
[null,{"$f":"IF(Conversions!P301=TRUE,\"In\",\"Out\")","v":"Out"},{"$f":"Conversions!S301","v":""},null,{"$f":"IFERROR(INDEX(C$2:C$344,SMALL(IF(B$2:B$344=\"In\",ROW(C$2:C$344)-ROW(C$2)+1),ROW(C274))),\"\")","v":""}]
[null,{"$f":"IF(Conversions!P302=TRUE,\"In\",\"Out\")","v":"Out"},{"$f":"Conversions!S302","v":""},null,{"$f":"IFERROR(INDEX(C$2:C$344,SMALL(IF(B$2:B$344=\"In\",ROW(C$2:C$344)-ROW(C$2)+1),ROW(C275))),\"\")","v":""}]
[null,{"$f":"IF(Conversions!P303=TRUE,\"In\",\"Out\")","v":"Out"},{"$f":"Conversions!S303","v":""},null,{"$f":"IFERROR(INDEX(C$2:C$344,SMALL(IF(B$2:B$344=\"In\",ROW(C$2:C$344)-ROW(C$2)+1),ROW(C276))),\"\")","v":""}]
[null,{"$f":"IF(Conversions!P304=TRUE,\"In\",\"Out\")","v":"Out"},{"$f":"Conversions!S304","v":""},null,{"$f":"IFERROR(INDEX(C$2:C$344,SMALL(IF(B$2:B$344=\"In\",ROW(C$2:C$344)-ROW(C$2)+1),ROW(C277))),\"\")","v":""}]
[null,{"$f":"IF(Conversions!P305=TRUE,\"In\",\"Out\")","v":"Out"},{"$f":"Conversions!S305","v":""},null,{"$f":"IFERROR(INDEX(C$2:C$344,SMALL(IF(B$2:B$344=\"In\",ROW(C$2:C$344)-ROW(C$2)+1),ROW(C278))),\"\")","v":""}]
[null,{"$f":"IF(Conversions!P306=TRUE,\"In\",\"Out\")","v":"Out"},{"$f":"Conversions!S306","v":""},null,{"$f":"IFERROR(INDEX(C$2:C$344,SMALL(IF(B$2:B$344=\"In\",ROW(C$2:C$344)-ROW(C$2)+1),ROW(C279))),\"\")","v":""}]
[null,{"$f":"IF(Conversions!P307=TRUE,\"In\",\"Out\")","v":"Out"},{"$f":"Conversions!S307","v":""},null,{"$f":"IFERROR(INDEX(C$2:C$344,SMALL(IF(B$2:B$344=\"In\",ROW(C$2:C$344)-ROW(C$2)+1),ROW(C280))),\"\")","v":""}]
[null,{"$f":"IF(Conversions!P308=TRUE,\"In\",\"Out\")","v":"Out"},{"$f":"Conversions!S308","v":""},null,{"$f":"IFERROR(INDEX(C$2:C$344,SMALL(IF(B$2:B$344=\"In\",ROW(C$2:C$344)-ROW(C$2)+1),ROW(C281))),\"\")","v":""}]
[null,{"$f":"IF(Conversions!P309=TRUE,\"In\",\"Out\")","v":"Out"},{"$f":"Conversions!S309","v":""},null,{"$f":"IFERROR(INDEX(C$2:C$344,SMALL(IF(B$2:B$344=\"In\",ROW(C$2:C$344)-ROW(C$2)+1),ROW(C282))),\"\")","v":""}]
[null,{"$f":"IF(Conversions!P310=TRUE,\"In\",\"Out\")","v":"Out"},{"$f":"Conversions!S310","v":""},null,{"$f":"IFERROR(INDEX(C$2:C$344,SMALL(IF(B$2:B$344=\"In\",ROW(C$2:C$344)-ROW(C$2)+1),ROW(C283))),\"\")","v":""}]
[null,{"$f":"IF(Conversions!P311=TRUE,\"In\",\"Out\")","v":"Out"},{"$f":"Conversions!S311","v":""},null,{"$f":"IFERROR(INDEX(C$2:C$344,SMALL(IF(B$2:B$344=\"In\",ROW(C$2:C$344)-ROW(C$2)+1),ROW(C284))),\"\")","v":""}]
[null,{"$f":"IF(Conversions!P312=TRUE,\"In\",\"Out\")","v":"Out"},{"$f":"Conversions!S312","v":""},null,{"$f":"IFERROR(INDEX(C$2:C$344,SMALL(IF(B$2:B$344=\"In\",ROW(C$2:C$344)-ROW(C$2)+1),ROW(C285))),\"\")","v":""}]
[null,{"$f":"IF(Conversions!P313=TRUE,\"In\",\"Out\")","v":"Out"},{"$f":"Conversions!S313","v":""},null,{"$f":"IFERROR(INDEX(C$2:C$344,SMALL(IF(B$2:B$344=\"In\",ROW(C$2:C$344)-ROW(C$2)+1),ROW(C286))),\"\")","v":""}]
[null,{"$f":"IF(Conversions!P314=TRUE,\"In\",\"Out\")","v":"Out"},{"$f":"Conversions!S314","v":""},null,{"$f":"IFERROR(INDEX(C$2:C$344,SMALL(IF(B$2:B$344=\"In\",ROW(C$2:C$344)-ROW(C$2)+1),ROW(C287))),\"\")","v":""}]
[null,{"$f":"IF(Conversions!P315=TRUE,\"In\",\"Out\")","v":"Out"},{"$f":"Conversions!S315","v":""},null,{"$f":"IFERROR(INDEX(C$2:C$344,SMALL(IF(B$2:B$344=\"In\",ROW(C$2:C$344)-ROW(C$2)+1),ROW(C288))),\"\")","v":""}]
[null,{"$f":"IF(Conversions!P316=TRUE,\"In\",\"Out\")","v":"Out"},{"$f":"Conversions!S316","v":""},null,{"$f":"IFERROR(INDEX(C$2:C$344,SMALL(IF(B$2:B$344=\"In\",ROW(C$2:C$344)-ROW(C$2)+1),ROW(C289))),\"\")","v":""}]
[null,{"$f":"IF(Conversions!P317=TRUE,\"In\",\"Out\")","v":"Out"},{"$f":"Conversions!S317","v":""},null,{"$f":"IFERROR(INDEX(C$2:C$344,SMALL(IF(B$2:B$344=\"In\",ROW(C$2:C$344)-ROW(C$2)+1),ROW(C290))),\"\")","v":""}]
[null,{"$f":"IF(Conversions!P318=TRUE,\"In\",\"Out\")","v":"Out"},{"$f":"Conversions!S318","v":""},null,{"$f":"IFERROR(INDEX(C$2:C$344,SMALL(IF(B$2:B$344=\"In\",ROW(C$2:C$344)-ROW(C$2)+1),ROW(C291))),\"\")","v":""}]
[null,{"$f":"IF(Conversions!P319=TRUE,\"In\",\"Out\")","v":"Out"},{"$f":"Conversions!S319","v":""},null,{"$f":"IFERROR(INDEX(C$2:C$344,SMALL(IF(B$2:B$344=\"In\",ROW(C$2:C$344)-ROW(C$2)+1),ROW(C292))),\"\")","v":""}]
[null,{"$f":"IF(Conversions!P320=TRUE,\"In\",\"Out\")","v":"Out"},{"$f":"Conversions!S320","v":""},null,{"$f":"IFERROR(INDEX(C$2:C$344,SMALL(IF(B$2:B$344=\"In\",ROW(C$2:C$344)-ROW(C$2)+1),ROW(C293))),\"\")","v":""}]
[null,{"$f":"IF(Conversions!P321=TRUE,\"In\",\"Out\")","v":"Out"},{"$f":"Conversions!S321","v":""},null,{"$f":"IFERROR(INDEX(C$2:C$344,SMALL(IF(B$2:B$344=\"In\",ROW(C$2:C$344)-ROW(C$2)+1),ROW(C294))),\"\")","v":""}]
[null,{"$f":"IF(Conversions!P322=TRUE,\"In\",\"Out\")","v":"Out"},{"$f":"Conversions!S322","v":""},null,{"$f":"IFERROR(INDEX(C$2:C$344,SMALL(IF(B$2:B$344=\"In\",ROW(C$2:C$344)-ROW(C$2)+1),ROW(C295))),\"\")","v":""}]
[null,{"$f":"IF(Conversions!P323=TRUE,\"In\",\"Out\")","v":"Out"},{"$f":"Conversions!S323","v":""},null,{"$f":"IFERROR(INDEX(C$2:C$344,SMALL(IF(B$2:B$344=\"In\",ROW(C$2:C$344)-ROW(C$2)+1),ROW(C296))),\"\")","v":""}]
[null,{"$f":"IF(Conversions!P324=TRUE,\"In\",\"Out\")","v":"Out"},{"$f":"Conversions!S324","v":""},null,{"$f":"IFERROR(INDEX(C$2:C$344,SMALL(IF(B$2:B$344=\"In\",ROW(C$2:C$344)-ROW(C$2)+1),ROW(C297))),\"\")","v":""}]
[null,{"$f":"IF(Conversions!P325=TRUE,\"In\",\"Out\")","v":"Out"},{"$f":"Conversions!S325","v":""},null,{"$f":"IFERROR(INDEX(C$2:C$344,SMALL(IF(B$2:B$344=\"In\",ROW(C$2:C$344)-ROW(C$2)+1),ROW(C298))),\"\")","v":""}]
[null,{"$f":"IF(Conversions!P326=TRUE,\"In\",\"Out\")","v":"Out"},{"$f":"Conversions!S326","v":""},null,{"$f":"IFERROR(INDEX(C$2:C$344,SMALL(IF(B$2:B$344=\"In\",ROW(C$2:C$344)-ROW(C$2)+1),ROW(C299))),\"\")","v":""}]
[null,{"$f":"IF(Conversions!P327=TRUE,\"In\",\"Out\")","v":"Out"},{"$f":"Conversions!S327","v":""},null,{"$f":"IFERROR(INDEX(C$2:C$344,SMALL(IF(B$2:B$344=\"In\",ROW(C$2:C$344)-ROW(C$2)+1),ROW(C300))),\"\")","v":""}]
[null,{"$f":"IF(Conversions!P328=TRUE,\"In\",\"Out\")","v":"Out"},{"$f":"Conversions!S328","v":""},null,{"$f":"IFERROR(INDEX(C$2:C$344,SMALL(IF(B$2:B$344=\"In\",ROW(C$2:C$344)-ROW(C$2)+1),ROW(C301))),\"\")","v":""}]
[null,{"$f":"IF(Conversions!P329=TRUE,\"In\",\"Out\")","v":"Out"},{"$f":"Conversions!S329","v":""},null,{"$f":"IFERROR(INDEX(C$2:C$344,SMALL(IF(B$2:B$344=\"In\",ROW(C$2:C$344)-ROW(C$2)+1),ROW(C302))),\"\")","v":""}]
[null,{"$f":"IF(Conversions!P330=TRUE,\"In\",\"Out\")","v":"Out"},{"$f":"Conversions!S330","v":""},null,{"$f":"IFERROR(INDEX(C$2:C$344,SMALL(IF(B$2:B$344=\"In\",ROW(C$2:C$344)-ROW(C$2)+1),ROW(C303))),\"\")","v":""}]
[null,{"$f":"IF(Conversions!P331=TRUE,\"In\",\"Out\")","v":"Out"},{"$f":"Conversions!S331","v":""},null,{"$f":"IFERROR(INDEX(C$2:C$344,SMALL(IF(B$2:B$344=\"In\",ROW(C$2:C$344)-ROW(C$2)+1),ROW(C304))),\"\")","v":""}]
[null,{"$f":"IF(Conversions!P332=TRUE,\"In\",\"Out\")","v":"Out"},{"$f":"Conversions!S332","v":""},null,{"$f":"IFERROR(INDEX(C$2:C$344,SMALL(IF(B$2:B$344=\"In\",ROW(C$2:C$344)-ROW(C$2)+1),ROW(C305))),\"\")","v":""}]
[null,{"$f":"IF(Conversions!P333=TRUE,\"In\",\"Out\")","v":"Out"},{"$f":"Conversions!S333","v":""},null,{"$f":"IFERROR(INDEX(C$2:C$344,SMALL(IF(B$2:B$344=\"In\",ROW(C$2:C$344)-ROW(C$2)+1),ROW(C306))),\"\")","v":""}]
[null,{"$f":"IF(Conversions!P334=TRUE,\"In\",\"Out\")","v":"Out"},{"$f":"Conversions!S334","v":""},null,{"$f":"IFERROR(INDEX(C$2:C$344,SMALL(IF(B$2:B$344=\"In\",ROW(C$2:C$344)-ROW(C$2)+1),ROW(C307))),\"\")","v":""}]
[null,{"$f":"IF(Conversions!P335=TRUE,\"In\",\"Out\")","v":"Out"},{"$f":"Conversions!S335","v":""},null,{"$f":"IFERROR(INDEX(C$2:C$344,SMALL(IF(B$2:B$344=\"In\",ROW(C$2:C$344)-ROW(C$2)+1),ROW(C308))),\"\")","v":""}]
[null,{"$f":"IF(Conversions!P336=TRUE,\"In\",\"Out\")","v":"Out"},{"$f":"Conversions!S336","v":""},null,{"$f":"IFERROR(INDEX(C$2:C$344,SMALL(IF(B$2:B$344=\"In\",ROW(C$2:C$344)-ROW(C$2)+1),ROW(C309))),\"\")","v":""}]
[null,{"$f":"IF(Conversions!P337=TRUE,\"In\",\"Out\")","v":"Out"},{"$f":"Conversions!S337","v":""},null,{"$f":"IFERROR(INDEX(C$2:C$344,SMALL(IF(B$2:B$344=\"In\",ROW(C$2:C$344)-ROW(C$2)+1),ROW(C310))),\"\")","v":""}]
[null,{"$f":"IF(Conversions!P338=TRUE,\"In\",\"Out\")","v":"Out"},{"$f":"Conversions!S338","v":""},null,{"$f":"IFERROR(INDEX(C$2:C$344,SMALL(IF(B$2:B$344=\"In\",ROW(C$2:C$344)-ROW(C$2)+1),ROW(C311))),\"\")","v":""}]
[null,{"$f":"IF(Conversions!P339=TRUE,\"In\",\"Out\")","v":"Out"},{"$f":"Conversions!S339","v":""},null,{"$f":"IFERROR(INDEX(C$2:C$344,SMALL(IF(B$2:B$344=\"In\",ROW(C$2:C$344)-ROW(C$2)+1),ROW(C312))),\"\")","v":""}]
[null,{"$f":"IF(Conversions!P340=TRUE,\"In\",\"Out\")","v":"Out"},{"$f":"Conversions!S340","v":""},null,{"$f":"IFERROR(INDEX(C$2:C$344,SMALL(IF(B$2:B$344=\"In\",ROW(C$2:C$344)-ROW(C$2)+1),ROW(C313))),\"\")","v":""}]
[null,{"$f":"IF(Conversions!P341=TRUE,\"In\",\"Out\")","v":"Out"},{"$f":"Conversions!S341","v":""},null,{"$f":"IFERROR(INDEX(C$2:C$344,SMALL(IF(B$2:B$344=\"In\",ROW(C$2:C$344)-ROW(C$2)+1),ROW(C314))),\"\")","v":""}]
[null,{"$f":"IF(Conversions!P342=TRUE,\"In\",\"Out\")","v":"Out"},{"$f":"Conversions!S342","v":""},null,{"$f":"IFERROR(INDEX(C$2:C$344,SMALL(IF(B$2:B$344=\"In\",ROW(C$2:C$344)-ROW(C$2)+1),ROW(C315))),\"\")","v":""}]
[null,{"$f":"IF(Conversions!P343=TRUE,\"In\",\"Out\")","v":"Out"},{"$f":"Conversions!S343","v":""},null,{"$f":"IFERROR(INDEX(C$2:C$344,SMALL(IF(B$2:B$344=\"In\",ROW(C$2:C$344)-ROW(C$2)+1),ROW(C316))),\"\")","v":""}]
[null,{"$f":"IF(Conversions!P344=TRUE,\"In\",\"Out\")","v":"Out"},{"$f":"Conversions!S344","v":""},null,{"$f":"IFERROR(INDEX(C$2:C$344,SMALL(IF(B$2:B$344=\"In\",ROW(C$2:C$344)-ROW(C$2)+1),ROW(C317))),\"\")","v":""}]
[null,{"$f":"IF(Conversions!P345=TRUE,\"In\",\"Out\")","v":"Out"},{"$f":"Conversions!S345","v":""},null,{"$f":"IFERROR(INDEX(C$2:C$344,SMALL(IF(B$2:B$344=\"In\",ROW(C$2:C$344)-ROW(C$2)+1),ROW(C318))),\"\")","v":""}]
[null,{"$f":"IF(Conversions!P346=TRUE,\"In\",\"Out\")","v":"Out"},{"$f":"Conversions!S346","v":""},null,{"$f":"IFERROR(INDEX(C$2:C$344,SMALL(IF(B$2:B$344=\"In\",ROW(C$2:C$344)-ROW(C$2)+1),ROW(C319))),\"\")","v":""}]
[null,{"$f":"IF(Conversions!P347=TRUE,\"In\",\"Out\")","v":"Out"},{"$f":"Conversions!S347","v":""},null,{"$f":"IFERROR(INDEX(C$2:C$331,SMALL(IF(B$2:B$331=\"In\",ROW(C$2:C$331)-ROW(C$2)+1),ROW(C320))),\"\")","v":""}]
[null,{"$f":"IF(Conversions!P348=TRUE,\"In\",\"Out\")","v":"Out"},{"$f":"Conversions!S348","v":""},null,"This financial statement is an accurate record of the information provided."]
[null,{"$f":"IF(Conversions!P349=TRUE,\"In\",\"Out\")","v":"Out"},{"$f":"Conversions!S349","v":""}]
[null,{"$f":"IF(Conversions!P350=TRUE,\"In\",\"Out\")","v":"Out"},{"$f":"Conversions!S350","v":""}]
[null,{"$f":"IF(Conversions!P351=TRUE,\"In\",\"Out\")","v":"Out"},{"$f":"Conversions!S351","v":""},null,"Signed:                                                                                               Date:"]
[null,{"$f":"IF(Conversions!P352=TRUE,\"In\",\"Out\")","v":"Out"},{"$f":"Conversions!S352","v":""},null,{"$f":"IFERROR(INDEX($C$2:$C$508,SMALL(IF(ISTEXT($C$2:$C$508),ROW($C$2:$C$508),\"\"), ROW(C346))),\"\")","v":""}]
[null,{"$f":"IF(Conversions!P348=TRUE,\"In\",\"Out\")","v":"Out"},{"$f":"Conversions!S348","v":""},null,{"$f":"IFERROR(INDEX($C$2:$C$508,SMALL(IF(ISTEXT($C$2:$C$508),ROW($C$2:$C$508),\"\"), ROW(C347))),\"\")","v":""}]
[null,{"$f":"IF(Conversions!P349=TRUE,\"In\",\"Out\")","v":"Out"},{"$f":"Conversions!S349","v":""},null,{"$f":"IFERROR(INDEX($C$2:$C$508,SMALL(IF(ISTEXT($C$2:$C$508),ROW($C$2:$C$508),\"\"), ROW(C348))),\"\")","v":""}]
[null,{"$f":"IF(Conversions!P350=TRUE,\"In\",\"Out\")","v":"Out"},{"$f":"Conversions!S350","v":""}]
[null,{"$f":"IF(Conversions!P351=TRUE,\"In\",\"Out\")","v":"Out"},{"$f":"Conversions!S351","v":""}]
[null,{"$f":"IF(Conversions!P352=TRUE,\"In\",\"Out\")","v":"Out"},{"$f":"Conversions!S352","v":""}]
[null,{"$f":"IF(Conversions!P353=TRUE,\"In\",\"Out\")","v":"Out"},{"$f":"Conversions!S353","v":""}]
[null,{"$f":"IF(Conversions!P354=TRUE,\"In\",\"Out\")","v":"Out"},{"$f":"Conversions!S354","v":""}]
[null,{"$f":"IF(Conversions!P355=TRUE,\"In\",\"Out\")","v":"Out"},{"$f":"Conversions!S355","v":""}]
[null,{"$f":"IF(Conversions!P356=TRUE,\"In\",\"Out\")","v":"Out"},{"$f":"Conversions!S356","v":""}]
[null,{"$f":"IF(Conversions!P357=TRUE,\"In\",\"Out\")","v":"Out"},{"$f":"Conversions!S357","v":""}]
[null,{"$f":"IF(Conversions!P358=TRUE,\"In\",\"Out\")","v":"Out"},{"$f":"Conversions!S358","v":""}]
[null,{"$f":"IF(Conversions!P359=TRUE,\"In\",\"Out\")","v":"Out"},{"$f":"Conversions!S359","v":""}]
[null,{"$f":"IF(Conversions!P360=TRUE,\"In\",\"Out\")","v":"Out"},{"$f":"Conversions!S360","v":""}]
[null,{"$f":"IF(Conversions!P361=TRUE,\"In\",\"Out\")","v":"Out"},{"$f":"Conversions!S361","v":""}]
[null,{"$f":"IF(Conversions!P362=TRUE,\"In\",\"Out\")","v":"Out"},{"$f":"Conversions!S362","v":""}]
[null,{"$f":"IF(Conversions!P363=TRUE,\"In\",\"Out\")","v":"Out"},{"$f":"Conversions!S363","v":""}]
[null,{"$f":"IF(Conversions!P364=TRUE,\"In\",\"Out\")","v":"Out"},{"$f":"Conversions!S364","v":"\""}]
[null,{"$f":"IF(Conversions!P365=TRUE,\"In\",\"Out\")","v":"Out"},{"$f":"Conversions!S365","v":0}]
[null,{"$f":"IF(Conversions!P366=TRUE,\"In\",\"Out\")","v":"Out"},{"$f":"Conversions!S366","v":0}]
[null,{"$f":"IF(Conversions!P367=TRUE,\"In\",\"Out\")","v":"Out"},{"$f":"Conversions!S367","v":0}]
[null,{"$f":"IF(Conversions!P368=TRUE,\"In\",\"Out\")","v":"Out"},{"$f":"Conversions!S368","v":0}]
[null,{"$f":"IF(Conversions!P371=TRUE,\"In\",\"Out\")","v":"Out"},{"$f":"Conversions!S371","v":0}]
[null,{"$f":"IF(Conversions!P369=TRUE,\"In\",\"Out\")","v":"Out"},{"$f":"Conversions!S369","v":0}]
[null,{"$f":"IF(Conversions!P372=TRUE,\"In\",\"Out\")","v":"Out"},{"$f":"Conversions!S372","v":0}]
[null,{"$f":"IF(Conversions!P373=TRUE,\"In\",\"Out\")","v":"Out"},{"$f":"Conversions!S373","v":0}]

{"sheet":"SFS v2.0","index":10,"n_rows":258,"n_cols":32,"rows_kept":258,"cut":false,"hidden":false,"merged":[[6,23,6,31],[7,23,7,31],[8,23,8,31],[9,23,9,31],[22,29,22,31],[24,29,24,31],[39,12,39,14],[40,12,40,14],[41,12,41,14],[28,16,28,31],[27,12,27,14],[24,12,24,14],[25,12,25,14],[26,12,26,14],[28,12,28,14],[29,12,29,14],[29,16,29,31],[30,16,38,31],[32,12,32,14],[33,12,33,14],[34,12,34,14],[35,12,35,14],[36,12,36,14],[241,1,241,31],[242,1,242,31],[243,1,243,31],[244,1,244,31],[245,1,245,31],[246,1,246,31],[247,1,247,31],[257,1,257,31],[248,1,248,31],[249,1,249,31],[250,1,250,31],[251,1,251,31],[252,1,252,31],[253,1,253,31],[254,1,254,31],[255,1,255,31],[256,1,256,31],[232,1,232,31],[233,1,233,31],[234,1,234,31],[235,1,235,31],[236,1,236,31],[237,1,237,31],[238,1,238,31],[239,1,239,31],[240,1,240,31],[223,1,223,31],[224,1,224,31],[225,1,225,31],[226,1,226,31],[227,1,227,31],[228,1,228,31],[229,1,229,31],[230,1,230,31],[231,1,231,31],[209,1,209,31],[210,1,210,31],[211,1,216,31],[217,1,217,31],[218,1,218,31],[219,1,219,31],[220,1,220,31],[221,1,221,31],[222,1,222,31],[49,12,49,14],[92,29,92,31],[208,20,208,29],[208,30,208,31],[123,29,123,31],[123,13,123,15],[121,27,121,28],[121,13,121,15],[122,13,122,15],[122,29,122,31],[122,17,122,28],[122,1,122,12],[118,1,118,7],[118,9,118,11],[118,17,118,23],[118,24,118,26],[118,27,118,28],[195,24,195,26],[189,1,189,7],[192,17,192,23],[189,13,189,15],[190,13,190,15],[191,13,191,15],[192,13,192,15],[42,12,42,14],[43,12,43,14],[46,12,46,14],[43,16,43,31],[44,16,44,31],[45,16,45,31],[46,16,46,31],[47,16,47,31],[48,16,48,31],[48,12,48,14],[44,12,44,14],[45,12,45,14],[47,12,47,14],[62,16,62,31],[49,16,49,31],[59,16,59,31],[50,16,50,31],[51,16,51,31],[52,16,52,31],[53,16,53,31],[54,16,54,31],[55,16,55,31],[56,16,56,31],[57,16,57,31],[58,16,58,31],[66,16,66,31],[67,16,67,31],[77,29,77,31],[78,29,78,31],[193,13,193,15],[194,13,194,15],[195,13,195,15],[195,9,195,11],[194,9,194,11],[189,9,189,11],[190,9,190,11],[191,9,191,11],[192,9,192,11],[189,24,189,26],[190,24,190,26],[191,24,191,26],[188,29,188,31],[100,29,100,31],[101,29,101,31],[102,29,102,31],[103,29,103,31],[117,29,117,31],[118,29,118,31],[119,29,119,31],[188,1,188,7],[188,9,188,11],[188,13,188,15],[188,17,188,23],[188,24,188,26],[188,27,188,28],[190,1,190,7],[191,1,191,7],[189,17,189,23],[190,17,190,23],[191,17,191,23],[187,1,187,7],[187,9,187,11],[187,13,187,15],[187,17,187,23],[187,27,187,28],[187,29,187,31],[187,24,187,26],[185,1,185,7],[185,9,185,11],[185,13,185,15],[185,17,185,23],[185,24,185,26],[185,27,185,28],[185,29,185,31],[186,1,186,7],[186,9,186,11],[186,13,186,15],[186,17,186,23],[186,24,186,26],[186,27,186,28],[186,29,186,31],[183,1,183,7],[183,9,183,11],[183,13,183,15],[183,17,183,23],[183,24,183,26],[183,27,183,28],[183,29,183,31],[184,1,184,7],[184,9,184,11],[184,13,184,15],[184,17,184,23],[184,24,184,26],[184,27,184,28],[184,29,184,31],[181,1,181,7],[181,9,181,11],[181,13,181,15],[181,17,181,23],[181,24,181,26],[181,27,181,28],[181,29,181,31],[182,1,182,7],[182,9,182,11],[182,13,182,15],[182,17,182,23],[182,24,182,26],[182,27,182,28],[182,29,182,31],[179,1,179,7],[179,9,179,11],[179,13,179,15],[179,17,179,23],[179,24,179,26],[179,27,179,28],[179,29,179,31],[180,1,180,7],[180,9,180,11],[180,13,180,15],[180,17,180,23],[180,24,180,26],[180,27,180,28],[180,29,180,31],[177,1,177,7],[177,9,177,11],[177,13,177,15],[177,17,177,23],[177,24,177,26],[177,27,177,28],[177,29,177,31],[178,1,178,7],[178,9,178,11],[178,13,178,15],[178,17,178,23],[178,24,178,26],[178,27,178,28],[178,29,178,31],[175,1,175,7],[175,9,175,11],[175,13,175,15],[175,17,175,23],[175,24,175,26],[175,27,175,28],[175,29,175,31],[176,1,176,7],[176,9,176,11],[176,13,176,15],[176,17,176,23],[176,24,176,26],[176,27,176,28],[176,29,176,31],[173,1,173,7],[173,9,173,11],[173,13,173,15],[173,17,173,23],[173,24,173,26],[173,27,173,28],[173,29,173,31],[174,1,174,7],[174,9,174,11],[174,13,174,15],[174,17,174,23],[174,24,174,26],[174,27,174,28],[174,29,174,31],[171,1,171,7],[171,9,171,11],[171,13,171,15],[171,17,171,23],[171,24,171,26],[171,27,171,28],[171,29,171,31],[172,1,172,7],[172,9,172,11],[172,13,172,15],[172,17,172,23],[172,24,172,26],[172,27,172,28],[172,29,172,31],[169,1,169,7],[169,9,169,11],[169,13,169,15],[169,17,169,23],[169,24,169,26],[169,27,169,28],[169,29,169,31],[170,1,170,7],[170,9,170,11],[170,13,170,15],[170,17,170,23],[170,24,170,26],[170,27,170,28],[170,29,170,31],[167,1,167,7],[167,9,167,11],[167,13,167,15],[167,17,167,23],[167,24,167,26],[167,27,167,28],[167,29,167,31],[168,1,168,7],[168,9,168,11],[168,13,168,15],[168,17,168,23],[168,24,168,26],[168,27,168,28],[168,29,168,31],[165,1,165,7],[165,9,165,11],[165,13,165,15],[165,17,165,23],[165,24,165,26],[165,27,165,28],[165,29,165,31],[166,1,166,7],[166,9,166,11],[166,13,166,15],[166,17,166,23],[166,24,166,26],[166,27,166,28],[166,29,166,31],[163,1,163,7],[163,9,163,11],[163,13,163,15],[163,17,163,23],[163,24,163,26],[163,27,163,28],[163,29,163,31],[164,1,164,7],[164,9,164,11],[164,13,164,15],[164,17,164,23],[164,24,164,26],[164,27,164,28],[164,29,164,31],[161,1,161,7],[161,9,161,11],[161,13,161,15],[161,17,161,23],[161,24,161,26],[161,27,161,28],[161,29,161,31],[162,1,162,7],[162,9,162,11],[162,13,162,15],[162,17,162,23],[162,24,162,26],[162,27,162,28],[162,29,162,31],[159,1,159,7],[159,9,159,11],[159,13,159,15],[159,17,159,23],[159,24,159,26],[159,27,159,28],[159,29,159,31],[160,1,160,7],[160,9,160,11],[160,13,160,15],[160,17,160,23],[160,24,160,26],[160,27,160,28],[160,29,160,31],[157,1,157,7],[157,9,157,11],[157,13,157,15],[157,17,157,23],[157,24,157,26],[157,27,157,28],[157,29,157,31],[158,1,158,7],[158,9,158,11],[158,13,158,15],[158,17,158,23],[158,24,158,26],[158,27,158,28],[158,29,158,31],[155,1,155,7],[155,9,155,11],[155,13,155,15],[155,17,155,23],[155,24,155,26],[155,27,155,28],[155,29,155,31],[156,1,156,7],[156,9,156,11],[156,13,156,15],[156,17,156,23],[156,24,156,26],[156,27,156,28],[156,29,156,31],[153,1,153,7],[153,9,153,11],[153,13,153,15],[153,17,153,23],[153,24,153,26],[153,27,153,28],[153,29,153,31],[154,1,154,7],[154,9,154,11],[154,13,154,15],[154,17,154,23],[154,24,154,26],[154,27,154,28],[154,29,154,31],[151,1,151,7],[151,9,151,11],[151,13,151,15],[151,17,151,23],[151,24,151,26],[151,27,151,28],[151,29,151,31],[152,1,152,7],[152,9,152,11],[152,13,152,15],[152,17,152,23],[152,24,152,26],[152,27,152,28],[152,29,152,31],[149,1,149,7],[149,9,149,11],[149,13,149,15],[149,17,149,23],[149,24,149,26],[149,27,149,28],[149,29,149,31],[150,1,150,7],[150,9,150,11],[150,13,150,15],[150,17,150,23],[150,24,150,26],[150,27,150,28],[150,29,150,31],[147,1,147,7],[147,9,147,11],[147,13,147,15],[147,17,147,23],[147,24,147,26],[147,27,147,28],[147,29,147,31],[148,1,148,7],[148,9,148,11],[148,13,148,15],[148,17,148,23],[148,24,148,26],[148,27,148,28],[148,29,148,31],[145,1,145,7],[145,9,145,11],[145,13,145,15],[145,17,145,23],[145,24,145,26],[145,27,145,28],[145,29,145,31],[146,1,146,7],[146,9,146,11],[146,13,146,15],[146,17,146,23],[146,24,146,26],[146,27,146,28],[146,29,146,31],[120,29,120,31],[121,29,121,31],[105,29,105,31],[106,29,106,31],[107,29,107,31],[108,29,108,31],[109,29,109,31],[110,29,110,31],[111,29,111,31],[112,29,112,31],[113,29,113,31],[104,29,104,31],[114,29,114,31],[115,29,115,31],[116,29,116,31],[119,1,119,7],[119,9,119,11],[119,17,119,23],[119,24,119,26],[119,27,119,28],[115,27,115,28],[116,1,116,7],[116,9,116,11],[116,17,116,23],[116,24,116,26],[116,27,116,28],[115,13,115,15],[116,13,116,15],[117,13,117,15],[113,1,113,7],[113,9,113,11],[113,17,113,23],[113,24,113,26],[113,27,113,28],[114,1,114,7],[120,1,120,7],[120,9,120,11],[79,29,79,31],[80,29,80,31],[81,29,81,31],[82,29,82,31],[83,29,83,31],[79,24,79,26],[95,29,95,31],[120,17,120,23],[79,27,79,28],[84,29,84,31],[85,29,85,31],[86,29,86,31],[87,29,87,31],[88,29,88,31],[89,29,89,31],[90,29,90,31],[91,29,91,31],[93,29,93,31],[94,29,94,31],[96,29,96,31],[97,29,97,31],[98,29,98,31],[99,29,99,31],[125,24,125,26],[123,9,123,11],[123,2,123,8],[123,17,123,23],[123,24,123,26],[121,1,121,7],[121,9,121,11],[121,17,121,23],[121,24,121,26],[120,24,120,26],[120,27,120,28],[119,13,119,15],[120,13,120,15],[117,1,117,7],[117,9,117,11],[117,17,117,23],[117,24,117,26],[117,27,117,28],[118,13,118,15],[115,1,115,7],[115,9,115,11],[115,17,115,23],[115,24,115,26],[114,9,114,11],[114,17,114,23],[114,24,114,26],[114,27,114,28],[113,13,113,15],[114,13,114,15],[111,1,111,7],[111,9,111,11],[111,17,111,23],[111,24,111,26],[111,27,111,28],[112,1,112,7],[112,9,112,11],[112,17,112,23],[112,24,112,26],[112,27,112,28],[111,13,111,15],[112,13,112,15],[109,1,109,7],[109,9,109,11],[109,17,109,23],[109,24,109,26],[109,27,109,28],[110,1,110,7],[110,9,110,11],[110,17,110,23],[110,24,110,26],[110,27,110,28],[109,13,109,15],[110,13,110,15],[107,1,107,7],[107,9,107,11],[107,17,107,23],[107,24,107,26],[107,27,107,28],[108,1,108,7],[108,9,108,11],[108,17,108,23],[108,24,108,26],[108,27,108,28],[107,13,107,15],[108,13,108,15],[105,1,105,7],[105,9,105,11],[105,17,105,23],[105,24,105,26],[105,27,105,28],[106,1,106,7],[106,9,106,11],[106,17,106,23],[106,24,106,26],[106,27,106,28],[105,13,105,15],[106,13,106,15],[103,1,103,7],[103,9,103,11],[103,17,103,23],[103,24,103,26],[103,27,103,28],[104,1,104,7],[104,9,104,11],[104,17,104,23],[104,24,104,26],[104,27,104,28],[103,13,103,15],[104,13,104,15],[101,1,101,7],[101,9,101,11],[101,17,101,23],[101,24,101,26],[101,27,101,28],[102,1,102,7],[102,9,102,11],[102,17,102,23],[102,24,102,26],[102,27,102,28],[101,13,101,15],[102,13,102,15],[99,1,99,7],[99,9,99,11],[99,17,99,23],[99,24,99,26],[99,27,99,28],[100,1,100,7],[100,9,100,11],[100,17,100,23],[100,24,100,26],[100,27,100,28],[99,13,99,15],[100,13,100,15],[97,1,97,7],[97,9,97,11],[97,17,97,23],[97,24,97,26],[97,27,97,28],[98,1,98,7],[98,9,98,11],[98,17,98,23],[98,24,98,26],[98,27,98,28],[97,13,97,15],[98,13,98,15],[95,1,95,7],[95,9,95,11],[95,17,95,23],[95,24,95,26],[95,27,95,28],[96,1,96,7],[96,9,96,11],[96,17,96,23],[96,24,96,26],[96,27,96,28],[95,13,95,15],[96,13,96,15],[93,1,93,7],[93,9,93,11],[93,17,93,23],[93,24,93,26],[93,27,93,28],[94,1,94,7],[94,9,94,11],[94,17,94,23],[94,24,94,26],[94,27,94,28],[93,13,93,15],[94,13,94,15],[91,1,91,7],[91,9,91,11],[91,17,91,23],[91,24,91,26],[91,27,91,28],[92,1,92,7],[92,9,92,11],[92,17,92,23],[92,24,92,26],[92,27,92,28],[91,13,91,15],[92,13,92,15],[89,1,89,7],[89,9,89,11],[89,17,89,23],[89,24,89,26],[89,27,89,28],[90,1,90,7],[90,9,90,11],[90,17,90,23],[90,24,90,26],[90,27,90,28],[89,13,89,15],[90,13,90,15],[87,1,87,7],[87,9,87,11],[87,17,87,23],[87,24,87,26],[87,27,87,28],[88,1,88,7],[88,9,88,11],[88,17,88,23],[88,24,88,26],[88,27,88,28],[87,13,87,15],[88,13,88,15],[85,1,85,7],[85,9,85,11],[85,17,85,23],[85,24,85,26],[85,27,85,28],[86,1,86,7],[86,9,86,11],[86,17,86,23],[86,24,86,26],[86,27,86,28],[85,13,85,15],[86,13,86,15],[83,1,83,7],[83,9,83,11],[83,17,83,23],[83,24,83,26],[83,27,83,28],[84,1,84,7],[84,9,84,11],[84,17,84,23],[84,24,84,26],[84,27,84,28],[83,13,83,15],[84,13,84,15],[81,9,81,11],[81,17,81,23],[81,24,81,26],[81,27,81,28],[82,1,82,7],[82,9,82,11],[82,17,82,23],[82,24,82,26],[82,27,82,28],[81,13,81,15],[82,13,82,15],[77,1,77,7],[78,1,78,7],[79,1,79,7],[79,9,79,11],[79,17,79,23],[78,9,78,11],[50,12,50,14],[51,12,51,14],[62,12,63,14],[58,12,58,14],[59,12,59,14],[60,12,60,14],[77,17,77,23],[78,13,78,15],[79,13,79,15],[77,9,77,11],[78,17,78,23],[77,13,77,15],[63,16,63,31],[64,16,64,31],[53,12,53,14],[52,12,52,14],[54,12,54,14],[57,12,57,14],[4,9,4,14],[5,9,5,14],[7,9,7,14],[9,9,9,14],[11,9,11,14],[12,9,12,14],[23,12,23,14],[14,9,14,14],[15,9,15,14],[17,11,17,14],[16,11,16,14],[4,23,4,31],[5,23,5,31],[10,23,10,30],[8,9,8,14],[10,9,10,14],[11,23,11,30],[12,23,12,30],[13,23,13,30],[200,2,200,8],[200,9,200,11],[200,13,200,15],[200,17,200,23],[192,1,192,7],[193,1,193,7],[194,1,194,7],[195,1,195,7],[196,1,196,7],[197,1,197,7],[197,17,197,23],[197,9,197,11],[194,17,194,23],[195,17,195,23],[196,17,196,23],[193,9,193,11],[198,2,198,8],[198,17,198,23],[196,9,196,11],[196,13,196,15],[197,13,197,15],[193,17,193,23],[39,16,39,31],[60,16,60,31],[196,27,196,28],[197,27,197,28],[61,16,61,31],[80,1,80,7],[80,9,80,11],[80,17,80,23],[80,24,80,26],[80,27,80,28],[77,24,77,26],[77,27,77,28],[80,13,80,15],[78,24,78,26],[78,27,78,28],[81,1,81,7],[41,16,41,31],[42,16,42,31],[200,24,200,26],[200,29,200,31],[189,29,189,31],[190,29,190,31],[191,29,191,31],[192,29,192,31],[193,29,193,31],[194,29,194,31],[195,29,195,31],[196,29,196,31],[197,29,197,31],[189,27,189,28],[190,27,190,28],[191,27,191,28],[192,27,192,28],[193,27,193,28],[194,27,194,28],[195,27,195,28],[192,24,192,26],[196,24,196,26],[197,24,197,26],[198,24,198,26],[193,24,193,26],[194,24,194,26]]}
[]
[]
[]
[]
[null,"Name:",null,null,null,null,null,null,null,{"$f":"IF(Start!$C$9=\"\",\"\",Start!$C$9)","v":""},null,null,null,null,null,null,"Contact/team name:",null,null,null,null,null,null,{"$f":"IF(Start!$I$9=\"\",\"\",Start!$I$9)","v":""}]
[null,"D.O.B:",null,null,null,null,null,null,null,{"$f":"IF(Start!$C$11=\"\",\"\",Start!$C$11)","v":""},null,null,null,null,null,null,"Agency:",null,null,null,null,null,null,{"$f":"IF(Start!$I$11=\"\",\"\",Start!$I$11)","v":""}]
[null,"Application: ",null,null,null,null,null,null,null,{"$f":"Start!C13","v":"Single:"},null,null,{"$f":"Start!E13","v":"Joint:"},null,null,null,"Agency address:",null,null,null,null,null,null,{"$f":"IF(Start!$I$13=\"\",\"\",Start!$I$13)","v":""}]
[null,"Partner: (if applicable):",null,null,null,null,null,null,null,{"$f":"IF(Start!$C$15=\"\",\"\",Start!$C$15)","v":""},null,null,null,null,null,null,null,null,null,null,null,null,null,{"$f":"IF(Start!$I$14=\"\",\"\",Start!$I$14)","v":""}]
[null,"Partner D.O.B. (if applicable):",null,null,null,null,null,null,null,{"$f":"IF(Start!$C$17=\"\",\"\",Start!$C$17)","v":""},null,null,null,null,null,null,null,null,null,null,null,null,null,{"$f":"IF(Start!$I$15=\"\",\"\",Start!$I$15)","v":""}]
[null,"Address:",null,null,null,null,null,null,null,{"$f":"IF(Start!$C$18=\"\",\"\",Start!$C$18)","v":""},null,null,null,null,null,null,null,null,null,null,null,null,null,{"$f":"IF(Start!$I$16=\"\",\"\",Start!$I$16)","v":""}]
[null,null,null,null,null,null,null,null,null,{"$f":"IF(Start!$C$19=\"\",\"\",Start!$C$19)","v":""},null,null,null,null,null,null,"Membership code number:",null,null,null,null,null,null,{"$f":"IF(Start!$I$18=\"\",\"\",Start!$I$18)","v":12884569}]
[null,null,null,null,null,null,null,null,null,{"$f":"IF(Start!$C$20=\"\",\"\",Start!$C$20)","v":""},null,null,null,null,null,null,"Case reference number:",null,null,null,null,null,null,{"$f":"IF(Start!$I$20=\"\",\"\",Start!$I$20)","v":""}]
[null,null,null,null,null,null,null,null,null,{"$f":"IF(Start!$C$21=\"\",\"\",Start!$C$21)","v":""},null,null,null,null,null,null,"Date of statement:",null,null,null,null,null,null,{"$f":"IF(Start!$I$22=\"\",\"\",Start!$I$22)","v":""}]
[null,"Dependent children: ",null,null,null,null,null,null,null,"Under 16:",{"$f":"Start!$D$23","v":0},null,null,"16-18:",{"$f":"Start!$F$23","v":0},null,"Date of review (if applicable):",null,null,null,null,null,null,{"$f":"IF(Start!$I$24=\"\",\"\",Start!$I$24)","v":""}]
[null,"Other dependants: ",null,null,null,null,null,null,null,{"$f":"IF(Start!$C$24=\"\",\"\",Start!$C$24)","v":""},null,null,null,null,null,null,"Employment: "]
[null,null,null,null,null,null,null,null,null,{"$f":"IF(Start!$C$25=\"\",\"\",Start!C25)","v":""}]
[null,"Number in household:",null,null,null,null,null,null,null,null,null,{"$f":"Start!$C$27","v":0}]
[null,"Number of vehicles in household:",null,null,null,null,null,null,null,null,null,{"$f":"Start!$C$29","v":0},null,null,null,null,"Partner's employment: "]
[null,{"$f":"Start!B31","v":"Housing tenure:"}]
[]
[]
[]
[null,null,null,null,null,null,null,null,null,null,null,null,null,null,null,null,"Please confirm you have considered or discussed with an ",null,null,null,null,null,null,null,null,null,null,null,null,"Tick to confirm ✔"]
[null,"Overview",null,null,null,null,null,null,null,null,null,null," Amount (£)",null,null,null,"adviser) the use of any assets to make lump sum payments"]
[null,"Total income",null,null,null,null,null,null,null,null,null,null,{"$f":"Conversions!$H$48","v":0},null,null,null,"Please confirm that a monthly contribution to savings has been ",null,null,null,null,null,null,null,null,null,null,null,null,"Tick to confirm ✔"]
[null,"Total outgoings",null,null,null,null,null,null,null,null,null,null,{"$f":"Conversions!$E$368","v":0},null,null,null,"considered (or discussed with an adviser)"]
[null,"Savings contribution",null,null,null,null,null,null,null,null,null,null,{"$f":"Conversions!$E$369","v":0}]
[null,"Debt admin fee (if applicable):",null,null,null,null,null,null,null,null,null,null,{"$f":"Conversions!$G$370","v":0},null,null,null,"Additional notes "]
[null,null,null,null,null,null,null,null,null,null,null,"Total available for priority creditors",{"$f":"$M$25-$M$26-$M$27-$M$28","v":0},null,null,null,"Reasons for debt, client circumstances or vulnerabilities, temporary situations"]
[null,null,null,null,null,null,null,null,null,null,null,"Total available for non priority creditors",{"$f":"Conversions!$E$385","v":0},null,null,null,"detail regarding benefits or repayment terms:"]
[null,null,null,null,null,null,null,null,null,null,null,null,null,null,null,null,{"$f":"IF(Notes!E8=\"\",\"\",Notes!E8)","v":""}]
[null,"Monthly Income"]
[null,"Earnings",null,null,null,null,null,null,null,null,null,null,{"$f":"Conversions!$H$14","v":0}]
[null,"Benefits and tax credits ",null,null,null,null,null,null,null,null,null,null,{"$f":"Conversions!$H$30","v":0}]
[null,"Pensions",null,null,null,null,null,null,null,null,null,null,{"$f":"Conversions!$H$38","v":0}]
[null,"Other income",null,null,null,null,null,null,null,null,null,null,{"$f":"Conversions!$H$47","v":0}]
[null,null,null,null,null,null,null,null,null,null,null,"Total income",{"$f":"Conversions!$H$48","v":0}]
[]
[null,"Monthly Outgoings: Fixed Costs"]
[null,{"$f":"Conversions!C52","v":"Rent"},null,null,null,null,null,null,null,null,null,null,{"$f":"Conversions!$H$52","v":0},null,null,null,{"$f":"IF(Notes!E17=\"\",\"\",Notes!E17)","v":""}]
[null,{"$f":"Conversions!C54","v":"Mortgage"},null,null,null,null,null,null,null,null,null,null,{"$f":"Conversions!$H$54","v":0},null,null,null,{"$f":"IF(Notes!E18=\"\",\"\",Notes!E18)","v":"Notes:"}]
[null,"Other secured loans",null,null,null,null,null,null,null,null,null,null,{"$f":"Conversions!$H$56","v":0},null,null,null,{"$f":"IF(Notes!E19=\"\",\"\",Notes!E19)","v":""}]
[null,"Council Tax / Rates",null,null,null,null,null,null,null,null,null,null,{"$f":"Conversions!$H$57","v":0},null,null,null,{"$f":"IF(Notes!E20=\"\",\"\",Notes!E20)","v":""}]
[null,"Other home and contents",null,null,null,null,null,null,null,null,null,null,{"$f":"Conversions!$H$53+Conversions!$H$55+Conversions!$H$58+Conversions!$H$59+Conversions!$H$60","v":0},null,null,null,{"$f":"IF(Notes!E21=\"\",\"\",Notes!E21)","v":""}]
[null,"Gas",null,null,null,null,null,null,null,null,null,null,{"$f":"Conversions!$H$64","v":0},null,null,null,{"$f":"IF(Notes!E22=\"\",\"\",Notes!E22)","v":""}]
[null,"Electric",null,null,null,null,null,null,null,null,null,null,{"$f":"Conversions!$H$65","v":0},null,null,null,{"$f":"IF(Notes!E23=\"\",\"\",Notes!E23)","v":""}]
[null,"Other utility costs (e.g. coal, oil, calor gas)",null,null,null,null,null,null,null,null,null,null,{"$f":"Conversions!$H$66+Conversions!$H$67","v":0},null,null,null,{"$f":"IF(Notes!E24=\"\",\"\",Notes!E24)","v":""}]
[null,"Water",null,null,null,null,null,null,null,null,null,null,{"$f":"Conversions!$H$75","v":0},null,null,null,{"$f":"IF(Notes!E25=\"\",\"\",Notes!E25)","v":""}]
[null,"Care and health costs",null,null,null,null,null,null,null,null,null,null,{"$f":"Conversions!$H$85","v":0},null,null,null,{"$f":"IF(Notes!E26=\"\",\"\",Notes!E26)","v":""}]
[null,"Transport and travel",null,null,null,null,null,null,null,null,null,null,{"$f":"Conversions!$H$97","v":0},null,null,null,{"$f":"IF(Notes!E27=\"\",\"\",Notes!E27)","v":""}]
[null,"School costs",null,null,null,null,null,null,null,null,null,null,{"$f":"Conversions!$H$104","v":0},null,null,null,{"$f":"IF(Notes!E28=\"\",\"\",Notes!E28)","v":""}]
[null,"Pensions and insurances",null,null,null,null,null,null,null,null,null,null,{"$f":"Conversions!$H$113","v":0},null,null,null,{"$f":"IF(Notes!E29=\"\",\"\",Notes!E29)","v":""}]
[null,"Professional costs",null,null,null,null,null,null,null,null,null,null,{"$f":"Conversions!$H$120","v":0},null,null,null,{"$f":"IF(Notes!E30=\"\",\"\",Notes!E30)","v":""}]
[null,"Other essential costs",null,null,null,null,null,null,null,null,null,null,{"$f":"Conversions!$H$128","v":0},null,null,null,{"$f":"IF(Notes!E31=\"\",\"\",Notes!E31)","v":""}]
[null,null,null,null,null,null,null,null,null,null,null,"Total fixed costs",{"$f":"Conversions!$H$129","v":0},null,null,null,{"$f":"IF(Notes!E32=\"\",\"\",Notes!E32)","v":""}]
[null,null,null,null,null,null,null,null,null,null,null,null,null,null,null,null,{"$f":"IF(Notes!E33=\"\",\"\",Notes!E33)","v":""}]
[null,"Monthly Outgoings: Flexible Costs",null,null,null,null,null,null,null,null,null,null,null,null,null,null,{"$f":"IF(Notes!E34=\"\",\"\",Notes!E34)","v":""}]
[null,"Communications and leisure",null,null,null,null,null,null,null,null,null,null,{"$f":"Conversions!$H$141","v":0},null,null,null,{"$f":"IF(Notes!E35=\"\",\"\",Notes!E35)","v":""}]
[null,"Food and housekeeping",null,null,null,null,null,null,null,null,null,null,{"$f":"Conversions!$H$154","v":0},null,null,null,{"$f":"IF(Notes!E36=\"\",\"\",Notes!E36)","v":""}]
[null,"Personal costs",null,null,null,null,null,null,null,null,null,null,{"$f":"Conversions!$H$162","v":0},null,null,null,{"$f":"IF(Notes!E37=\"\",\"\",Notes!E37)","v":""}]
[null,null,null,null,null,null,null,null,null,null,null,"Total flexible costs",{"$f":"Conversions!$H$163","v":0},null,null,null,{"$f":"IF(Notes!E38=\"\",\"\",Notes!E38)","v":""}]
[null,null,null,null,null,null,null,null,null,null,null,null,null,null,null,null,{"$f":"IF(Notes!E39=\"\",\"\",Notes!E39)","v":""}]
[null,null,null,null,null,null,null,null,null,null,null,"Total monthly outgoings ",{"$f":"Conversions!$H$164","v":0},null,null,null,{"$f":"IF(Notes!E40=\"\",\"\",Notes!E40)","v":""}]
[null,null,null,null,null,null,null,null,null,null,null,"(fixed and flexible)",null,null,null,null,{"$f":"IF(Notes!E41=\"\",\"\",Notes!E41)","v":""}]
[null,null,null,null,null,null,null,null,null,null,null,null,null,null,null,null,{"$f":"IF(Notes!E42=\"\",\"\",Notes!E42)","v":""}]
[null,null,null,null,null,null,null,null,null,null,null,null,null,null,null,null,null,null,null,null,null,null,null,null,null,null,null,null,null,"Tick here if a notes continuation sheet is required"]
[null,null,null,null,null,null,null,null,null,null,null,null,null,null,null,null,true]
[]
[]
[]
[null,"Summary Version"]
[]
[]
[null,"Debts "]
[]
[null,"Priority Debts",null,null,null,null,null,null,null,null,null,null,null,null,null,null,null,"Non - Priority Debts"]
[]
[null,"Creditor",null,null,null,null,null,null,null,"Owed (£) ",null,null,null,"Offer",null,null,null,"Creditor",null,null,null,null,null,null,"Owed (£) ",null,null,"CCJ",null,"Offer"]
[null,{"$f":"IF(Debts!B6=\"\",\"\",Debts!B6)","v":""},null,null,null,null,null,null,null,{"$f":"IF(Debts!D6<>0,Debts!D6,\"\")","v":""},null,null,null,{"$f":"IF(Conversions!H167<>0,Conversions!H167,\"\")","v":""},null,null,null,{"$f":"IF(Debts!B110=\"\",\"\",Debts!B110)","v":""},null,null,null,null,null,null,{"$f":"IF(Conversions!C268<>0,Conversions!E268,\"\")","v":""},null,null,{"$f":"IF(Conversions!J268=TRUE,\"Y\",\"N\")","v":"N"},null,{"$f":"IF(Conversions!C268<>0,Conversions!O268,\"\")","v":""}]
[null,{"$f":"IF(Debts!B7=\"\",\"\",Debts!B7)","v":""},null,null,null,null,null,null,null,{"$f":"IF(Debts!D7<>0,Debts!D7,\"\")","v":""},null,null,null,{"$f":"IF(Conversions!H168<>0,Conversions!H168,\"\")","v":""},null,null,null,{"$f":"IF(Debts!B111=\"\",\"\",Debts!B111)","v":""},null,null,null,null,null,null,{"$f":"IF(Conversions!C269<>0,Conversions!E269,\"\")","v":""},null,null,{"$f":"IF(Conversions!J269=TRUE,\"Y\",\"N\")","v":"N"},null,{"$f":"IF(Conversions!C269<>0,Conversions!O269,\"\")","v":""}]
[null,{"$f":"IF(Debts!B8=\"\",\"\",Debts!B8)","v":""},null,null,null,null,null,null,null,{"$f":"IF(Debts!D8<>0,Debts!D8,\"\")","v":""},null,null,null,{"$f":"IF(Conversions!H169<>0,Conversions!H169,\"\")","v":""},null,null,null,{"$f":"IF(Debts!B112=\"\",\"\",Debts!B112)","v":""},null,null,null,null,null,null,{"$f":"IF(Conversions!C270<>0,Conversions!E270,\"\")","v":""},null,null,{"$f":"IF(Conversions!J270=TRUE,\"Y\",\"N\")","v":"N"},null,{"$f":"IF(Conversions!C270<>0,Conversions!O270,\"\")","v":""}]
[null,{"$f":"IF(Debts!B9=\"\",\"\",Debts!B9)","v":""},null,null,null,null,null,null,null,{"$f":"IF(Debts!D9<>0,Debts!D9,\"\")","v":""},null,null,null,{"$f":"IF(Conversions!H170<>0,Conversions!H170,\"\")","v":""},null,null,null,{"$f":"IF(Debts!B113=\"\",\"\",Debts!B113)","v":""},null,null,null,null,null,null,{"$f":"IF(Conversions!C271<>0,Conversions!E271,\"\")","v":""},null,null,{"$f":"IF(Conversions!J271=TRUE,\"Y\",\"N\")","v":"N"},null,{"$f":"IF(Conversions!C271<>0,Conversions!O271,\"\")","v":""}]
[null,{"$f":"IF(Debts!B10=\"\",\"\",Debts!B10)","v":""},null,null,null,null,null,null,null,{"$f":"IF(Debts!D10<>0,Debts!D10,\"\")","v":""},null,null,null,{"$f":"IF(Conversions!H171<>0,Conversions!H171,\"\")","v":""},null,null,null,{"$f":"IF(Debts!B114=\"\",\"\",Debts!B114)","v":""},null,null,null,null,null,null,{"$f":"IF(Conversions!C272<>0,Conversions!E272,\"\")","v":""},null,null,{"$f":"IF(Conversions!J272=TRUE,\"Y\",\"N\")","v":"N"},null,{"$f":"IF(Conversions!C272<>0,Conversions!O272,\"\")","v":""}]
[null,{"$f":"IF(Debts!B11=\"\",\"\",Debts!B11)","v":""},null,null,null,null,null,null,null,{"$f":"IF(Debts!D11<>0,Debts!D11,\"\")","v":""},null,null,null,{"$f":"IF(Conversions!H172<>0,Conversions!H172,\"\")","v":""},null,null,null,{"$f":"IF(Debts!B115=\"\",\"\",Debts!B115)","v":""},null,null,null,null,null,null,{"$f":"IF(Conversions!C273<>0,Conversions!E273,\"\")","v":""},null,null,{"$f":"IF(Conversions!J273=TRUE,\"Y\",\"N\")","v":"N"},null,{"$f":"IF(Conversions!C273<>0,Conversions!O273,\"\")","v":""}]
[null,{"$f":"IF(Debts!B12=\"\",\"\",Debts!B12)","v":""},null,null,null,null,null,null,null,{"$f":"IF(Debts!D12<>0,Debts!D12,\"\")","v":""},null,null,null,{"$f":"IF(Conversions!H173<>0,Conversions!H173,\"\")","v":""},null,null,null,{"$f":"IF(Debts!B116=\"\",\"\",Debts!B116)","v":""},null,null,null,null,null,null,{"$f":"IF(Conversions!C274<>0,Conversions!E274,\"\")","v":""},null,null,{"$f":"IF(Conversions!J274=TRUE,\"Y\",\"N\")","v":"N"},null,{"$f":"IF(Conversions!C274<>0,Conversions!O274,\"\")","v":""}]
[null,{"$f":"IF(Debts!B13=\"\",\"\",Debts!B13)","v":""},null,null,null,null,null,null,null,{"$f":"IF(Debts!D13<>0,Debts!D13,\"\")","v":""},null,null,null,{"$f":"IF(Conversions!H174<>0,Conversions!H174,\"\")","v":""},null,null,null,{"$f":"IF(Debts!B117=\"\",\"\",Debts!B117)","v":""},null,null,null,null,null,null,{"$f":"IF(Conversions!C275<>0,Conversions!E275,\"\")","v":""},null,null,{"$f":"IF(Conversions!J275=TRUE,\"Y\",\"N\")","v":"N"},null,{"$f":"IF(Conversions!C275<>0,Conversions!O275,\"\")","v":""}]
[null,{"$f":"IF(Debts!B14=\"\",\"\",Debts!B14)","v":""},null,null,null,null,null,null,null,{"$f":"IF(Debts!D14<>0,Debts!D14,\"\")","v":""},null,null,null,{"$f":"IF(Conversions!H175<>0,Conversions!H175,\"\")","v":""},null,null,null,{"$f":"IF(Debts!B118=\"\",\"\",Debts!B118)","v":""},null,null,null,null,null,null,{"$f":"IF(Conversions!C276<>0,Conversions!E276,\"\")","v":""},null,null,{"$f":"IF(Conversions!J276=TRUE,\"Y\",\"N\")","v":"N"},null,{"$f":"IF(Conversions!C276<>0,Conversions!O276,\"\")","v":""}]
[null,{"$f":"IF(Debts!B15=\"\",\"\",Debts!B15)","v":""},null,null,null,null,null,null,null,{"$f":"IF(Debts!D15<>0,Debts!D15,\"\")","v":""},null,null,null,{"$f":"IF(Conversions!H176<>0,Conversions!H176,\"\")","v":""},null,null,null,{"$f":"IF(Debts!B119=\"\",\"\",Debts!B119)","v":""},null,null,null,null,null,null,{"$f":"IF(Conversions!C277<>0,Conversions!E277,\"\")","v":""},null,null,{"$f":"IF(Conversions!J277=TRUE,\"Y\",\"N\")","v":"N"},null,{"$f":"IF(Conversions!C277<>0,Conversions!O277,\"\")","v":""}]
[null,{"$f":"IF(Debts!B16=\"\",\"\",Debts!B16)","v":""},null,null,null,null,null,null,null,{"$f":"IF(Debts!D16<>0,Debts!D16,\"\")","v":""},null,null,null,{"$f":"IF(Conversions!H177<>0,Conversions!H177,\"\")","v":""},null,null,null,{"$f":"IF(Debts!B120=\"\",\"\",Debts!B120)","v":""},null,null,null,null,null,null,{"$f":"IF(Conversions!C278<>0,Conversions!E278,\"\")","v":""},null,null,{"$f":"IF(Conversions!J278=TRUE,\"Y\",\"N\")","v":"N"},null,{"$f":"IF(Conversions!C278<>0,Conversions!O278,\"\")","v":""}]
[null,{"$f":"IF(Debts!B17=\"\",\"\",Debts!B17)","v":""},null,null,null,null,null,null,null,{"$f":"IF(Debts!D17<>0,Debts!D17,\"\")","v":""},null,null,null,{"$f":"IF(Conversions!H178<>0,Conversions!H178,\"\")","v":""},null,null,null,{"$f":"IF(Debts!B121=\"\",\"\",Debts!B121)","v":""},null,null,null,null,null,null,{"$f":"IF(Conversions!C279<>0,Conversions!E279,\"\")","v":""},null,null,{"$f":"IF(Conversions!J279=TRUE,\"Y\",\"N\")","v":"N"},null,{"$f":"IF(Conversions!C279<>0,Conversions!O279,\"\")","v":""}]
[null,{"$f":"IF(Debts!B18=\"\",\"\",Debts!B18)","v":""},null,null,null,null,null,null,null,{"$f":"IF(Debts!D18<>0,Debts!D18,\"\")","v":""},null,null,null,{"$f":"IF(Conversions!H179<>0,Conversions!H179,\"\")","v":""},null,null,null,{"$f":"IF(Debts!B122=\"\",\"\",Debts!B122)","v":""},null,null,null,null,null,null,{"$f":"IF(Conversions!C280<>0,Conversions!E280,\"\")","v":""},null,null,{"$f":"IF(Conversions!J280=TRUE,\"Y\",\"N\")","v":"N"},null,{"$f":"IF(Conversions!C280<>0,Conversions!O280,\"\")","v":""}]
[null,{"$f":"IF(Debts!B19=\"\",\"\",Debts!B19)","v":""},null,null,null,null,null,null,null,{"$f":"IF(Debts!D19<>0,Debts!D19,\"\")","v":""},null,null,null,{"$f":"IF(Conversions!H180<>0,Conversions!H180,\"\")","v":""},null,null,null,{"$f":"IF(Debts!B123=\"\",\"\",Debts!B123)","v":""},null,null,null,null,null,null,{"$f":"IF(Conversions!C281<>0,Conversions!E281,\"\")","v":""},null,null,{"$f":"IF(Conversions!J281=TRUE,\"Y\",\"N\")","v":"N"},null,{"$f":"IF(Conversions!C281<>0,Conversions!O281,\"\")","v":""}]
[null,{"$f":"IF(Debts!B20=\"\",\"\",Debts!B20)","v":""},null,null,null,null,null,null,null,{"$f":"IF(Debts!D20<>0,Debts!D20,\"\")","v":""},null,null,null,{"$f":"IF(Conversions!H181<>0,Conversions!H181,\"\")","v":""},null,null,null,{"$f":"IF(Debts!B124=\"\",\"\",Debts!B124)","v":""},null,null,null,null,null,null,{"$f":"IF(Conversions!C282<>0,Conversions!E282,\"\")","v":""},null,null,{"$f":"IF(Conversions!J282=TRUE,\"Y\",\"N\")","v":"N"},null,{"$f":"IF(Conversions!C282<>0,Conversions!O282,\"\")","v":""}]
[null,{"$f":"IF(Debts!B21=\"\",\"\",Debts!B21)","v":""},null,null,null,null,null,null,null,{"$f":"IF(Debts!D21<>0,Debts!D21,\"\")","v":""},null,null,null,{"$f":"IF(Conversions!H182<>0,Conversions!H182,\"\")","v":""},null,null,null,{"$f":"IF(Debts!B125=\"\",\"\",Debts!B125)","v":""},null,null,null,null,null,null,{"$f":"IF(Conversions!C283<>0,Conversions!E283,\"\")","v":""},null,null,{"$f":"IF(Conversions!J283=TRUE,\"Y\",\"N\")","v":"N"},null,{"$f":"IF(Conversions!C283<>0,Conversions!O283,\"\")","v":""}]
[null,{"$f":"IF(Debts!B22=\"\",\"\",Debts!B22)","v":""},null,null,null,null,null,null,null,{"$f":"IF(Debts!D22<>0,Debts!D22,\"\")","v":""},null,null,null,{"$f":"IF(Conversions!H183<>0,Conversions!H183,\"\")","v":""},null,null,null,{"$f":"IF(Debts!B126=\"\",\"\",Debts!B126)","v":""},null,null,null,null,null,null,{"$f":"IF(Conversions!C284<>0,Conversions!E284,\"\")","v":""},null,null,{"$f":"IF(Conversions!J284=TRUE,\"Y\",\"N\")","v":"N"},null,{"$f":"IF(Conversions!C284<>0,Conversions!O284,\"\")","v":""}]
[null,{"$f":"IF(Debts!B23=\"\",\"\",Debts!B23)","v":""},null,null,null,null,null,null,null,{"$f":"IF(Debts!D23<>0,Debts!D23,\"\")","v":""},null,null,null,{"$f":"IF(Conversions!H184<>0,Conversions!H184,\"\")","v":""},null,null,null,{"$f":"IF(Debts!B127=\"\",\"\",Debts!B127)","v":""},null,null,null,null,null,null,{"$f":"IF(Conversions!C285<>0,Conversions!E285,\"\")","v":""},null,null,{"$f":"IF(Conversions!J285=TRUE,\"Y\",\"N\")","v":"N"},null,{"$f":"IF(Conversions!C285<>0,Conversions!O285,\"\")","v":""}]
[null,{"$f":"IF(Debts!B24=\"\",\"\",Debts!B24)","v":""},null,null,null,null,null,null,null,{"$f":"IF(Debts!D24<>0,Debts!D24,\"\")","v":""},null,null,null,{"$f":"IF(Conversions!H185<>0,Conversions!H185,\"\")","v":""},null,null,null,{"$f":"IF(Debts!B128=\"\",\"\",Debts!B128)","v":""},null,null,null,null,null,null,{"$f":"IF(Conversions!C286<>0,Conversions!E286,\"\")","v":""},null,null,{"$f":"IF(Conversions!J286=TRUE,\"Y\",\"N\")","v":"N"},null,{"$f":"IF(Conversions!C286<>0,Conversions!O286,\"\")","v":""}]
[null,{"$f":"IF(Debts!B25=\"\",\"\",Debts!B25)","v":""},null,null,null,null,null,null,null,{"$f":"IF(Debts!D25<>0,Debts!D25,\"\")","v":""},null,null,null,{"$f":"IF(Conversions!H186<>0,Conversions!H186,\"\")","v":""},null,null,null,{"$f":"IF(Debts!B129=\"\",\"\",Debts!B129)","v":""},null,null,null,null,null,null,{"$f":"IF(Conversions!C287<>0,Conversions!E287,\"\")","v":""},null,null,{"$f":"IF(Conversions!J287=TRUE,\"Y\",\"N\")","v":"N"},null,{"$f":"IF(Conversions!C287<>0,Conversions!O287,\"\")","v":""}]
[null,{"$f":"IF(Debts!B26=\"\",\"\",Debts!B26)","v":""},null,null,null,null,null,null,null,{"$f":"IF(Debts!D26<>0,Debts!D26,\"\")","v":""},null,null,null,{"$f":"IF(Conversions!H187<>0,Conversions!H187,\"\")","v":""},null,null,null,{"$f":"IF(Debts!B130=\"\",\"\",Debts!B130)","v":""},null,null,null,null,null,null,{"$f":"IF(Conversions!C288<>0,Conversions!E288,\"\")","v":""},null,null,{"$f":"IF(Conversions!J288=TRUE,\"Y\",\"N\")","v":"N"},null,{"$f":"IF(Conversions!C288<>0,Conversions!O288,\"\")","v":""}]
[null,{"$f":"IF(Debts!B27=\"\",\"\",Debts!B27)","v":""},null,null,null,null,null,null,null,{"$f":"IF(Debts!D27<>0,Debts!D27,\"\")","v":""},null,null,null,{"$f":"IF(Conversions!H188<>0,Conversions!H188,\"\")","v":""},null,null,null,{"$f":"IF(Debts!B131=\"\",\"\",Debts!B131)","v":""},null,null,null,null,null,null,{"$f":"IF(Conversions!C289<>0,Conversions!E289,\"\")","v":""},null,null,{"$f":"IF(Conversions!J289=TRUE,\"Y\",\"N\")","v":"N"},null,{"$f":"IF(Conversions!C289<>0,Conversions!O289,\"\")","v":""}]
[null,{"$f":"IF(Debts!B28=\"\",\"\",Debts!B28)","v":""},null,null,null,null,null,null,null,{"$f":"IF(Debts!D28<>0,Debts!D28,\"\")","v":""},null,null,null,{"$f":"IF(Conversions!H189<>0,Conversions!H189,\"\")","v":""},null,null,null,{"$f":"IF(Debts!B132=\"\",\"\",Debts!B132)","v":""},null,null,null,null,null,null,{"$f":"IF(Conversions!C290<>0,Conversions!E290,\"\")","v":""},null,null,{"$f":"IF(Conversions!J290=TRUE,\"Y\",\"N\")","v":"N"},null,{"$f":"IF(Conversions!C290<>0,Conversions!O290,\"\")","v":""}]
[null,{"$f":"IF(Debts!B29=\"\",\"\",Debts!B29)","v":""},null,null,null,null,null,null,null,{"$f":"IF(Debts!D29<>0,Debts!D29,\"\")","v":""},null,null,null,{"$f":"IF(Conversions!H190<>0,Conversions!H190,\"\")","v":""},null,null,null,{"$f":"IF(Debts!B133=\"\",\"\",Debts!B133)","v":""},null,null,null,null,null,null,{"$f":"IF(Conversions!C291<>0,Conversions!E291,\"\")","v":""},null,null,{"$f":"IF(Conversions!J291=TRUE,\"Y\",\"N\")","v":"N"},null,{"$f":"IF(Conversions!C291<>0,Conversions!O291,\"\")","v":""}]
[null,{"$f":"IF(Debts!B30=\"\",\"\",Debts!B30)","v":""},null,null,null,null,null,null,null,{"$f":"IF(Debts!D30<>0,Debts!D30,\"\")","v":""},null,null,null,{"$f":"IF(Conversions!H191<>0,Conversions!H191,\"\")","v":""},null,null,null,{"$f":"IF(Debts!B134=\"\",\"\",Debts!B134)","v":""},null,null,null,null,null,null,{"$f":"IF(Conversions!C292<>0,Conversions!E292,\"\")","v":""},null,null,{"$f":"IF(Conversions!J292=TRUE,\"Y\",\"N\")","v":"N"},null,{"$f":"IF(Conversions!C292<>0,Conversions!O292,\"\")","v":""}]
[null,{"$f":"IF(Debts!B31=\"\",\"\",Debts!B31)","v":""},null,null,null,null,null,null,null,{"$f":"IF(Debts!D31<>0,Debts!D31,\"\")","v":""},null,null,null,{"$f":"IF(Conversions!H192<>0,Conversions!H192,\"\")","v":""},null,null,null,{"$f":"IF(Debts!B135=\"\",\"\",Debts!B135)","v":""},null,null,null,null,null,null,{"$f":"IF(Conversions!C293<>0,Conversions!E293,\"\")","v":""},null,null,{"$f":"IF(Conversions!J293=TRUE,\"Y\",\"N\")","v":"N"},null,{"$f":"IF(Conversions!C293<>0,Conversions!O293,\"\")","v":""}]
[null,{"$f":"IF(Debts!B32=\"\",\"\",Debts!B32)","v":""},null,null,null,null,null,null,null,{"$f":"IF(Debts!D32<>0,Debts!D32,\"\")","v":""},null,null,null,{"$f":"IF(Conversions!H193<>0,Conversions!H193,\"\")","v":""},null,null,null,{"$f":"IF(Debts!B136=\"\",\"\",Debts!B136)","v":""},null,null,null,null,null,null,{"$f":"IF(Conversions!C294<>0,Conversions!E294,\"\")","v":""},null,null,{"$f":"IF(Conversions!J294=TRUE,\"Y\",\"N\")","v":"N"},null,{"$f":"IF(Conversions!C294<>0,Conversions!O294,\"\")","v":""}]
[null,{"$f":"IF(Debts!B33=\"\",\"\",Debts!B33)","v":""},null,null,null,null,null,null,null,{"$f":"IF(Debts!D33<>0,Debts!D33,\"\")","v":""},null,null,null,{"$f":"IF(Conversions!H194<>0,Conversions!H194,\"\")","v":""},null,null,null,{"$f":"IF(Debts!B137=\"\",\"\",Debts!B137)","v":""},null,null,null,null,null,null,{"$f":"IF(Conversions!C295<>0,Conversions!E295,\"\")","v":""},null,null,{"$f":"IF(Conversions!J295=TRUE,\"Y\",\"N\")","v":"N"},null,{"$f":"IF(Conversions!C295<>0,Conversions!O295,\"\")","v":""}]
[null,{"$f":"IF(Debts!B34=\"\",\"\",Debts!B34)","v":""},null,null,null,null,null,null,null,{"$f":"IF(Debts!D34<>0,Debts!D34,\"\")","v":""},null,null,null,{"$f":"IF(Conversions!H195<>0,Conversions!H195,\"\")","v":""},null,null,null,{"$f":"IF(Debts!B138=\"\",\"\",Debts!B138)","v":""},null,null,null,null,null,null,{"$f":"IF(Conversions!C296<>0,Conversions!E296,\"\")","v":""},null,null,{"$f":"IF(Conversions!J296=TRUE,\"Y\",\"N\")","v":"N"},null,{"$f":"IF(Conversions!C296<>0,Conversions!O296,\"\")","v":""}]
[null,{"$f":"IF(Debts!B35=\"\",\"\",Debts!B35)","v":""},null,null,null,null,null,null,null,{"$f":"IF(Debts!D35<>0,Debts!D35,\"\")","v":""},null,null,null,{"$f":"IF(Conversions!H196<>0,Conversions!H196,\"\")","v":""},null,null,null,{"$f":"IF(Debts!B139=\"\",\"\",Debts!B139)","v":""},null,null,null,null,null,null,{"$f":"IF(Conversions!C297<>0,Conversions!E297,\"\")","v":""},null,null,{"$f":"IF(Conversions!J297=TRUE,\"Y\",\"N\")","v":"N"},null,{"$f":"IF(Conversions!C297<>0,Conversions!O297,\"\")","v":""}]
[null,{"$f":"IF(Debts!B36=\"\",\"\",Debts!B36)","v":""},null,null,null,null,null,null,null,{"$f":"IF(Debts!D36<>0,Debts!D36,\"\")","v":""},null,null,null,{"$f":"IF(Conversions!H197<>0,Conversions!H197,\"\")","v":""},null,null,null,{"$f":"IF(Debts!B140=\"\",\"\",Debts!B140)","v":""},null,null,null,null,null,null,{"$f":"IF(Conversions!C298<>0,Conversions!E298,\"\")","v":""},null,null,{"$f":"IF(Conversions!J298=TRUE,\"Y\",\"N\")","v":"N"},null,{"$f":"IF(Conversions!C298<>0,Conversions!O298,\"\")","v":""}]
[null,{"$f":"IF(Debts!B37=\"\",\"\",Debts!B37)","v":""},null,null,null,null,null,null,null,{"$f":"IF(Debts!D37<>0,Debts!D37,\"\")","v":""},null,null,null,{"$f":"IF(Conversions!H198<>0,Conversions!H198,\"\")","v":""},null,null,null,{"$f":"IF(Debts!B141=\"\",\"\",Debts!B141)","v":""},null,null,null,null,null,null,{"$f":"IF(Conversions!C299<>0,Conversions!E299,\"\")","v":""},null,null,{"$f":"IF(Conversions!J299=TRUE,\"Y\",\"N\")","v":"N"},null,{"$f":"IF(Conversions!C299<>0,Conversions!O299,\"\")","v":""}]
[null,{"$f":"IF(Debts!B38=\"\",\"\",Debts!B38)","v":""},null,null,null,null,null,null,null,{"$f":"IF(Debts!D38<>0,Debts!D38,\"\")","v":""},null,null,null,{"$f":"IF(Conversions!H199<>0,Conversions!H199,\"\")","v":""},null,null,null,{"$f":"IF(Debts!B142=\"\",\"\",Debts!B142)","v":""},null,null,null,null,null,null,{"$f":"IF(Conversions!C300<>0,Conversions!E300,\"\")","v":""},null,null,{"$f":"IF(Conversions!J300=TRUE,\"Y\",\"N\")","v":"N"},null,{"$f":"IF(Conversions!C300<>0,Conversions!O300,\"\")","v":""}]
[null,{"$f":"IF(Debts!B39=\"\",\"\",Debts!B39)","v":""},null,null,null,null,null,null,null,{"$f":"IF(Debts!D39<>0,Debts!D39,\"\")","v":""},null,null,null,{"$f":"IF(Conversions!H200<>0,Conversions!H200,\"\")","v":""},null,null,null,{"$f":"IF(Debts!B143=\"\",\"\",Debts!B143)","v":""},null,null,null,null,null,null,{"$f":"IF(Conversions!C301<>0,Conversions!E301,\"\")","v":""},null,null,{"$f":"IF(Conversions!J301=TRUE,\"Y\",\"N\")","v":"N"},null,{"$f":"IF(Conversions!C301<>0,Conversions!O301,\"\")","v":""}]
[null,{"$f":"IF(Debts!B40=\"\",\"\",Debts!B40)","v":""},null,null,null,null,null,null,null,{"$f":"IF(Debts!D40<>0,Debts!D40,\"\")","v":""},null,null,null,{"$f":"IF(Conversions!H201<>0,Conversions!H201,\"\")","v":""},null,null,null,{"$f":"IF(Debts!B144=\"\",\"\",Debts!B144)","v":""},null,null,null,null,null,null,{"$f":"IF(Conversions!C302<>0,Conversions!E302,\"\")","v":""},null,null,{"$f":"IF(Conversions!J302=TRUE,\"Y\",\"N\")","v":"N"},null,{"$f":"IF(Conversions!C302<>0,Conversions!O302,\"\")","v":""}]
[null,{"$f":"IF(Debts!B41=\"\",\"\",Debts!B41)","v":""},null,null,null,null,null,null,null,{"$f":"IF(Debts!D41<>0,Debts!D41,\"\")","v":""},null,null,null,{"$f":"IF(Conversions!H202<>0,Conversions!H202,\"\")","v":""},null,null,null,{"$f":"IF(Debts!B145=\"\",\"\",Debts!B145)","v":""},null,null,null,null,null,null,{"$f":"IF(Conversions!C303<>0,Conversions!E303,\"\")","v":""},null,null,{"$f":"IF(Conversions!J303=TRUE,\"Y\",\"N\")","v":"N"},null,{"$f":"IF(Conversions!C303<>0,Conversions!O303,\"\")","v":""}]
[null,{"$f":"IF(Debts!B42=\"\",\"\",Debts!B42)","v":""},null,null,null,null,null,null,null,{"$f":"IF(Debts!D42<>0,Debts!D42,\"\")","v":""},null,null,null,{"$f":"IF(Conversions!H203<>0,Conversions!H203,\"\")","v":""},null,null,null,{"$f":"IF(Debts!B146=\"\",\"\",Debts!B146)","v":""},null,null,null,null,null,null,{"$f":"IF(Conversions!C304<>0,Conversions!E304,\"\")","v":""},null,null,{"$f":"IF(Conversions!J304=TRUE,\"Y\",\"N\")","v":"N"},null,{"$f":"IF(Conversions!C304<>0,Conversions!O304,\"\")","v":""}]
[null,{"$f":"IF(Debts!B43=\"\",\"\",Debts!B43)","v":""},null,null,null,null,null,null,null,{"$f":"IF(Debts!D43<>0,Debts!D43,\"\")","v":""},null,null,null,{"$f":"IF(Conversions!H204<>0,Conversions!H204,\"\")","v":""},null,null,null,{"$f":"IF(Debts!B147=\"\",\"\",Debts!B147)","v":""},null,null,null,null,null,null,{"$f":"IF(Conversions!C305<>0,Conversions!E305,\"\")","v":""},null,null,{"$f":"IF(Conversions!J360=TRUE,\"Y\",\"N\")","v":"N"},null,{"$f":"IF(Conversions!C305<>0,Conversions!O305,\"\")","v":""}]
[null,{"$f":"IF(Debts!B44=\"\",\"\",Debts!B44)","v":""},null,null,null,null,null,null,null,{"$f":"IF(Debts!D44<>0,Debts!D44,\"\")","v":""},null,null,null,{"$f":"IF(Conversions!H205<>0,Conversions!H205,\"\")","v":""},null,null,null,{"$f":"IF(Debts!B148=\"\",\"\",Debts!B148)","v":""},null,null,null,null,null,null,{"$f":"IF(Conversions!C306<>0,Conversions!E306,\"\")","v":""},null,null,{"$f":"IF(Conversions!J361=TRUE,\"Y\",\"N\")","v":"N"},null,{"$f":"IF(Conversions!C306<>0,Conversions!O306,\"\")","v":""}]
[null,{"$f":"IF(Debts!B45=\"\",\"\",Debts!B45)","v":""},null,null,null,null,null,null,null,{"$f":"IF(Debts!D45<>0,Debts!D45,\"\")","v":""},null,null,null,{"$f":"IF(Conversions!H206<>0,Conversions!H206,\"\")","v":""},null,null,null,{"$f":"IF(Debts!B149=\"\",\"\",Debts!B149)","v":""},null,null,null,null,null,null,{"$f":"IF(Conversions!C307<>0,Conversions!E307,\"\")","v":""},null,null,{"$f":"IF(Conversions!J364=TRUE,\"Y\",\"N\")","v":"N"},null,{"$f":"IF(Conversions!C307<>0,Conversions!O307,\"\")","v":""}]
[null,{"$f":"IF(Debts!B46=\"\",\"\",Debts!B46)","v":""},null,null,null,null,null,null,null,{"$f":"IF(Debts!D46<>0,Debts!D46,\"\")","v":""},null,null,null,{"$f":"IF(Conversions!H207<>0,Conversions!H207,\"\")","v":""},null,null,null,{"$f":"IF(Debts!B150=\"\",\"\",Debts!B150)","v":""},null,null,null,null,null,null,{"$f":"IF(Conversions!C308<>0,Conversions!E308,\"\")","v":""},null,null,{"$f":"IF(Conversions!J365=TRUE,\"Y\",\"N\")","v":"N"},null,{"$f":"IF(Conversions!C308<>0,Conversions!O308,\"\")","v":""}]
[null,{"$f":"IF(Debts!B47=\"\",\"\",Debts!B47)","v":""},null,null,null,null,null,null,null,{"$f":"IF(Debts!D47<>0,Debts!D47,\"\")","v":""},null,null,null,{"$f":"IF(Conversions!H208<>0,Conversions!H208,\"\")","v":""},null,null,null,{"$f":"IF(Debts!B151=\"\",\"\",Debts!B151)","v":""},null,null,null,null,null,null,{"$f":"IF(Conversions!C309<>0,Conversions!E309,\"\")","v":""},null,null,{"$f":"IF(Conversions!J366=TRUE,\"Y\",\"N\")","v":"N"},null,{"$f":"IF(Conversions!C309<>0,Conversions!O309,\"\")","v":""}]
[null,{"$f":"IF(Debts!B48=\"\",\"\",Debts!B48)","v":""},null,null,null,null,null,null,null,{"$f":"IF(Debts!D48<>0,Debts!D48,\"\")","v":""},null,null,null,{"$f":"IF(Conversions!H209<>0,Conversions!H209,\"\")","v":""},null,null,null,{"$f":"IF(Debts!B152=\"\",\"\",Debts!B152)","v":""},null,null,null,null,null,null,{"$f":"IF(Conversions!C310<>0,Conversions!E310,\"\")","v":""},null,null,{"$f":"IF(Conversions!J367=TRUE,\"Y\",\"N\")","v":"N"},null,{"$f":"IF(Conversions!C310<>0,Conversions!O310,\"\")","v":""}]
[null,{"$f":"IF(Debts!B49=\"\",\"\",Debts!B49)","v":""},null,null,null,null,null,null,null,{"$f":"IF(Debts!D49<>0,Debts!D49,\"\")","v":""},null,null,null,{"$f":"IF(Conversions!H210<>0,Conversions!H210,\"\")","v":""},null,null,null,{"$f":"IF(Debts!B153=\"\",\"\",Debts!B153)","v":""},null,null,null,null,null,null,{"$f":"IF(Conversions!C311<>0,Conversions!E311,\"\")","v":""},null,null,{"$f":"IF(Conversions!J368=TRUE,\"Y\",\"N\")","v":"N"},null,{"$f":"IF(Conversions!C311<>0,Conversions!O311,\"\")","v":""}]
[null,"(tick if you have continued on next page)",null,null,null,null,null,null,null,null,null,null,null,false]
[null,null,"Total Priority debts",null,null,null,null,null,null,{"$f":"SUM(J79:L122)","v":0},{"$f":"Conversions!M426","v":0},{"$f":"Conversions!N426","v":0},null,{"$f":"SUM(N79:P122)","v":0},{"$f":"Conversions!Q426","v":0},{"$f":"Conversions!R426","v":0},null,"Total Non - Priority debts",null,null,null,null,null,null,{"$f":"SUM(Y79:AA122)","v":0},{"$f":"Conversions!AB426","v":0},{"$f":"Conversions!AC426","v":0},null,null,{"$f":"SUM(AD79:AF122)","v":0},{"$f":"Conversions!AG426","v":0},{"$f":"Conversions!AH426","v":0}]
[]
[null,null,null,null,null,null,null,null,null,null,null,null,null,null,null,null,null,null,null,null,null,null,null,"Token Payments",{"$f":"Debts!O209","v":0}]
[]
[null,"This financial statement is an accurate record of the information provided."]
[]
[]
[]
[]
[null,"Signed:",null,null,null,null,null,null,null,null,null,null,null,null,null,null,null,null,null,null,null,null,null,null,"Date:"]
[]
[]
[]
[]
[]
[null,"Summary Version"]
[]
[]
[null,"Debts (continued)"]
[]
[null,"Priority Debts",null,null,null,null,null,null,null,null,null,null,null,null,null,null,null,"Non - Priority Debts"]
[]
[null,"Creditor",null,null,null,null,null,null,null,"Owed (£) ",null,null,null,"Offer",null,null,null,"Creditor",null,null,null,null,null,null,"Owed (£) ",null,null,"CCJ",null,"Offer"]
[null,{"$f":"IF(Debts!B50=\"\",\"\",Debts!B50)","v":""},null,null,null,null,null,null,null,{"$f":"IF(Debts!D50<>0,Debts!D50,\"\")","v":""},null,null,null,{"$f":"IF(Conversions!H211<>0,Conversions!H211,\"\")","v":""},null,null,null,{"$f":"IF(Debts!B154=\"\",\"\",Debts!B154)","v":""},null,null,null,null,null,null,{"$f":"IF(Conversions!C312<>0,Conversions!E312,\"\")","v":""},null,null,{"$f":"IF(Conversions!J371=TRUE,\"Y\",\"N\")","v":"N"},null,{"$f":"IF(Conversions!C312<>0,Conversions!O312,\"\")","v":""}]
[null,{"$f":"IF(Debts!B51=\"\",\"\",Debts!B51)","v":""},null,null,null,null,null,null,null,{"$f":"IF(Debts!D51<>0,Debts!D51,\"\")","v":""},null,null,null,{"$f":"IF(Conversions!H212<>0,Conversions!H212,\"\")","v":""},null,null,null,{"$f":"IF(Debts!B155=\"\",\"\",Debts!B155)","v":""},null,null,null,null,null,null,{"$f":"IF(Conversions!C313<>0,Conversions!E313,\"\")","v":""},null,null,{"$f":"IF(Conversions!J369=TRUE,\"Y\",\"N\")","v":"N"},null,{"$f":"IF(Conversions!C313<>0,Conversions!O313,\"\")","v":""}]
[null,{"$f":"IF(Debts!B52=\"\",\"\",Debts!B52)","v":""},null,null,null,null,null,null,null,{"$f":"IF(Debts!D52<>0,Debts!D52,\"\")","v":""},null,null,null,{"$f":"IF(Conversions!H213<>0,Conversions!H213,\"\")","v":""},null,null,null,{"$f":"IF(Debts!B156=\"\",\"\",Debts!B156)","v":""},null,null,null,null,null,null,{"$f":"IF(Conversions!C314<>0,Conversions!E314,\"\")","v":""},null,null,{"$f":"IF(Conversions!J372=TRUE,\"Y\",\"N\")","v":"N"},null,{"$f":"IF(Conversions!C314<>0,Conversions!O314,\"\")","v":""}]
[null,{"$f":"IF(Debts!B53=\"\",\"\",Debts!B53)","v":""},null,null,null,null,null,null,null,{"$f":"IF(Debts!D53<>0,Debts!D53,\"\")","v":""},null,null,null,{"$f":"IF(Conversions!H214<>0,Conversions!H214,\"\")","v":""},null,null,null,{"$f":"IF(Debts!B157=\"\",\"\",Debts!B157)","v":""},null,null,null,null,null,null,{"$f":"IF(Conversions!C315<>0,Conversions!E315,\"\")","v":""},null,null,{"$f":"IF(Conversions!J373=TRUE,\"Y\",\"N\")","v":"N"},null,{"$f":"IF(Conversions!C315<>0,Conversions!O315,\"\")","v":""}]
[null,{"$f":"IF(Debts!B54=\"\",\"\",Debts!B54)","v":""},null,null,null,null,null,null,null,{"$f":"IF(Debts!D54<>0,Debts!D54,\"\")","v":""},null,null,null,{"$f":"IF(Conversions!H215<>0,Conversions!H215,\"\")","v":""},null,null,null,{"$f":"IF(Debts!B158=\"\",\"\",Debts!B158)","v":""},null,null,null,null,null,null,{"$f":"IF(Conversions!C316<>0,Conversions!E316,\"\")","v":""},null,null,{"$f":"IF(Conversions!J374=TRUE,\"Y\",\"N\")","v":"N"},null,{"$f":"IF(Conversions!C316<>0,Conversions!O316,\"\")","v":""}]
[null,{"$f":"IF(Debts!B55=\"\",\"\",Debts!B55)","v":""},null,null,null,null,null,null,null,{"$f":"IF(Debts!D55<>0,Debts!D55,\"\")","v":""},null,null,null,{"$f":"IF(Conversions!H216<>0,Conversions!H216,\"\")","v":""},null,null,null,{"$f":"IF(Debts!B159=\"\",\"\",Debts!B159)","v":""},null,null,null,null,null,null,{"$f":"IF(Conversions!C317<>0,Conversions!E317,\"\")","v":""},null,null,{"$f":"IF(Conversions!J375=TRUE,\"Y\",\"N\")","v":"N"},null,{"$f":"IF(Conversions!C317<>0,Conversions!O317,\"\")","v":""}]
[null,{"$f":"IF(Debts!B56=\"\",\"\",Debts!B56)","v":""},null,null,null,null,null,null,null,{"$f":"IF(Debts!D56<>0,Debts!D56,\"\")","v":""},null,null,null,{"$f":"IF(Conversions!H217<>0,Conversions!H217,\"\")","v":""},null,null,null,{"$f":"IF(Debts!B160=\"\",\"\",Debts!B160)","v":""},null,null,null,null,null,null,{"$f":"IF(Conversions!C318<>0,Conversions!E318,\"\")","v":""},null,null,{"$f":"IF(Conversions!J376=TRUE,\"Y\",\"N\")","v":"N"},null,{"$f":"IF(Conversions!C318<>0,Conversions!O318,\"\")","v":""}]
[null,{"$f":"IF(Debts!B57=\"\",\"\",Debts!B57)","v":""},null,null,null,null,null,null,null,{"$f":"IF(Debts!D57<>0,Debts!D57,\"\")","v":""},null,null,null,{"$f":"IF(Conversions!H218<>0,Conversions!H218,\"\")","v":""},null,null,null,{"$f":"IF(Debts!B161=\"\",\"\",Debts!B161)","v":""},null,null,null,null,null,null,{"$f":"IF(Conversions!C319<>0,Conversions!E319,\"\")","v":""},null,null,{"$f":"IF(Conversions!J377=TRUE,\"Y\",\"N\")","v":"N"},null,{"$f":"IF(Conversions!C319<>0,Conversions!O319,\"\")","v":""}]
[null,{"$f":"IF(Debts!B58=\"\",\"\",Debts!B58)","v":""},null,null,null,null,null,null,null,{"$f":"IF(Debts!D58<>0,Debts!D58,\"\")","v":""},null,null,null,{"$f":"IF(Conversions!H219<>0,Conversions!H219,\"\")","v":""},null,null,null,{"$f":"IF(Debts!B162=\"\",\"\",Debts!B162)","v":""},null,null,null,null,null,null,{"$f":"IF(Conversions!C320<>0,Conversions!E320,\"\")","v":""},null,null,{"$f":"IF(Conversions!J378=TRUE,\"Y\",\"N\")","v":"N"},null,{"$f":"IF(Conversions!C320<>0,Conversions!O320,\"\")","v":""}]
[null,{"$f":"IF(Debts!B59=\"\",\"\",Debts!B59)","v":""},null,null,null,null,null,null,null,{"$f":"IF(Debts!D59<>0,Debts!D59,\"\")","v":""},null,null,null,{"$f":"IF(Conversions!H220<>0,Conversions!H220,\"\")","v":""},null,null,null,{"$f":"IF(Debts!B163=\"\",\"\",Debts!B163)","v":""},null,null,null,null,null,null,{"$f":"IF(Conversions!C321<>0,Conversions!E321,\"\")","v":""},null,null,{"$f":"IF(Conversions!J379=TRUE,\"Y\",\"N\")","v":"N"},null,{"$f":"IF(Conversions!C321<>0,Conversions!O321,\"\")","v":""}]
[null,{"$f":"IF(Debts!B60=\"\",\"\",Debts!B60)","v":""},null,null,null,null,null,null,null,{"$f":"IF(Debts!D60<>0,Debts!D60,\"\")","v":""},null,null,null,{"$f":"IF(Conversions!H221<>0,Conversions!H221,\"\")","v":""},null,null,null,{"$f":"IF(Debts!B164=\"\",\"\",Debts!B164)","v":""},null,null,null,null,null,null,{"$f":"IF(Conversions!C322<>0,Conversions!E322,\"\")","v":""},null,null,{"$f":"IF(Conversions!J380=TRUE,\"Y\",\"N\")","v":"N"},null,{"$f":"IF(Conversions!C322<>0,Conversions!O322,\"\")","v":""}]
[null,{"$f":"IF(Debts!B61=\"\",\"\",Debts!B61)","v":""},null,null,null,null,null,null,null,{"$f":"IF(Debts!D61<>0,Debts!D61,\"\")","v":""},null,null,null,{"$f":"IF(Conversions!H222<>0,Conversions!H222,\"\")","v":""},null,null,null,{"$f":"IF(Debts!B165=\"\",\"\",Debts!B165)","v":""},null,null,null,null,null,null,{"$f":"IF(Conversions!C323<>0,Conversions!E323,\"\")","v":""},null,null,{"$f":"IF(Conversions!J381=TRUE,\"Y\",\"N\")","v":"N"},null,{"$f":"IF(Conversions!C323<>0,Conversions!O323,\"\")","v":""}]
[null,{"$f":"IF(Debts!B62=\"\",\"\",Debts!B62)","v":""},null,null,null,null,null,null,null,{"$f":"IF(Debts!D62<>0,Debts!D62,\"\")","v":""},null,null,null,{"$f":"IF(Conversions!H223<>0,Conversions!H223,\"\")","v":""},null,null,null,{"$f":"IF(Debts!B166=\"\",\"\",Debts!B166)","v":""},null,null,null,null,null,null,{"$f":"IF(Conversions!C324<>0,Conversions!E324,\"\")","v":""},null,null,{"$f":"IF(Conversions!J382=TRUE,\"Y\",\"N\")","v":"N"},null,{"$f":"IF(Conversions!C324<>0,Conversions!O324,\"\")","v":""}]
[null,{"$f":"IF(Debts!B63=\"\",\"\",Debts!B63)","v":""},null,null,null,null,null,null,null,{"$f":"IF(Debts!D63<>0,Debts!D63,\"\")","v":""},null,null,null,{"$f":"IF(Conversions!H224<>0,Conversions!H224,\"\")","v":""},null,null,null,{"$f":"IF(Debts!B167=\"\",\"\",Debts!B167)","v":""},null,null,null,null,null,null,{"$f":"IF(Conversions!C325<>0,Conversions!E325,\"\")","v":""},null,null,{"$f":"IF(Conversions!J383=TRUE,\"Y\",\"N\")","v":"N"},null,{"$f":"IF(Conversions!C325<>0,Conversions!O325,\"\")","v":""}]
[null,{"$f":"IF(Debts!B64=\"\",\"\",Debts!B64)","v":""},null,null,null,null,null,null,null,{"$f":"IF(Debts!D64<>0,Debts!D64,\"\")","v":""},null,null,null,{"$f":"IF(Conversions!H225<>0,Conversions!H225,\"\")","v":""},null,null,null,{"$f":"IF(Debts!B168=\"\",\"\",Debts!B168)","v":""},null,null,null,null,null,null,{"$f":"IF(Conversions!C326<>0,Conversions!E326,\"\")","v":""},null,null,{"$f":"IF(Conversions!J384=TRUE,\"Y\",\"N\")","v":"N"},null,{"$f":"IF(Conversions!C326<>0,Conversions!O326,\"\")","v":""}]
[null,{"$f":"IF(Debts!B65=\"\",\"\",Debts!B65)","v":""},null,null,null,null,null,null,null,{"$f":"IF(Debts!D65<>0,Debts!D65,\"\")","v":""},null,null,null,{"$f":"IF(Conversions!H226<>0,Conversions!H226,\"\")","v":""},null,null,null,{"$f":"IF(Debts!B169=\"\",\"\",Debts!B169)","v":""},null,null,null,null,null,null,{"$f":"IF(Conversions!C327<>0,Conversions!E327,\"\")","v":""},null,null,{"$f":"IF(Conversions!J385=TRUE,\"Y\",\"N\")","v":"N"},null,{"$f":"IF(Conversions!C327<>0,Conversions!O327,\"\")","v":""}]
[null,{"$f":"IF(Debts!B66=\"\",\"\",Debts!B66)","v":""},null,null,null,null,null,null,null,{"$f":"IF(Debts!D66<>0,Debts!D66,\"\")","v":""},null,null,null,{"$f":"IF(Conversions!H227<>0,Conversions!H227,\"\")","v":""},null,null,null,{"$f":"IF(Debts!B170=\"\",\"\",Debts!B170)","v":""},null,null,null,null,null,null,{"$f":"IF(Conversions!C328<>0,Conversions!E328,\"\")","v":""},null,null,{"$f":"IF(Conversions!J386=TRUE,\"Y\",\"N\")","v":"N"},null,{"$f":"IF(Conversions!C328<>0,Conversions!O328,\"\")","v":""}]
[null,{"$f":"IF(Debts!B67=\"\",\"\",Debts!B67)","v":""},null,null,null,null,null,null,null,{"$f":"IF(Debts!D67<>0,Debts!D67,\"\")","v":""},null,null,null,{"$f":"IF(Conversions!H228<>0,Conversions!H228,\"\")","v":""},null,null,null,{"$f":"IF(Debts!B171=\"\",\"\",Debts!B171)","v":""},null,null,null,null,null,null,{"$f":"IF(Conversions!C329<>0,Conversions!E329,\"\")","v":""},null,null,{"$f":"IF(Conversions!J387=TRUE,\"Y\",\"N\")","v":"N"},null,{"$f":"IF(Conversions!C329<>0,Conversions!O329,\"\")","v":""}]
[null,{"$f":"IF(Debts!B68=\"\",\"\",Debts!B68)","v":""},null,null,null,null,null,null,null,{"$f":"IF(Debts!D68<>0,Debts!D68,\"\")","v":""},null,null,null,{"$f":"IF(Conversions!H229<>0,Conversions!H229,\"\")","v":""},null,null,null,{"$f":"IF(Debts!B172=\"\",\"\",Debts!B172)","v":""},null,null,null,null,null,null,{"$f":"IF(Conversions!C330<>0,Conversions!E330,\"\")","v":""},null,null,{"$f":"IF(Conversions!J388=TRUE,\"Y\",\"N\")","v":"N"},null,{"$f":"IF(Conversions!C330<>0,Conversions!O330,\"\")","v":""}]
[null,{"$f":"IF(Debts!B69=\"\",\"\",Debts!B69)","v":""},null,null,null,null,null,null,null,{"$f":"IF(Debts!D69<>0,Debts!D69,\"\")","v":""},null,null,null,{"$f":"IF(Conversions!H230<>0,Conversions!H230,\"\")","v":""},null,null,null,{"$f":"IF(Debts!B173=\"\",\"\",Debts!B173)","v":""},null,null,null,null,null,null,{"$f":"IF(Conversions!C331<>0,Conversions!E331,\"\")","v":""},null,null,{"$f":"IF(Conversions!J389=TRUE,\"Y\",\"N\")","v":"N"},null,{"$f":"IF(Conversions!C331<>0,Conversions!O331,\"\")","v":""}]
[null,{"$f":"IF(Debts!B70=\"\",\"\",Debts!B70)","v":""},null,null,null,null,null,null,null,{"$f":"IF(Debts!D70<>0,Debts!D70,\"\")","v":""},null,null,null,{"$f":"IF(Conversions!H231<>0,Conversions!H231,\"\")","v":""},null,null,null,{"$f":"IF(Debts!B174=\"\",\"\",Debts!B174)","v":""},null,null,null,null,null,null,{"$f":"IF(Conversions!C332<>0,Conversions!E332,\"\")","v":""},null,null,{"$f":"IF(Conversions!J390=TRUE,\"Y\",\"N\")","v":"N"},null,{"$f":"IF(Conversions!C332<>0,Conversions!O332,\"\")","v":""}]
[null,{"$f":"IF(Debts!B71=\"\",\"\",Debts!B71)","v":""},null,null,null,null,null,null,null,{"$f":"IF(Debts!D71<>0,Debts!D71,\"\")","v":""},null,null,null,{"$f":"IF(Conversions!H232<>0,Conversions!H232,\"\")","v":""},null,null,null,{"$f":"IF(Debts!B175=\"\",\"\",Debts!B175)","v":""},null,null,null,null,null,null,{"$f":"IF(Conversions!C333<>0,Conversions!E333,\"\")","v":""},null,null,{"$f":"IF(Conversions!J391=TRUE,\"Y\",\"N\")","v":"N"},null,{"$f":"IF(Conversions!C333<>0,Conversions!O333,\"\")","v":""}]
[null,{"$f":"IF(Debts!B72=\"\",\"\",Debts!B72)","v":""},null,null,null,null,null,null,null,{"$f":"IF(Debts!D72<>0,Debts!D72,\"\")","v":""},null,null,null,{"$f":"IF(Conversions!H233<>0,Conversions!H233,\"\")","v":""},null,null,null,{"$f":"IF(Debts!B176=\"\",\"\",Debts!B176)","v":""},null,null,null,null,null,null,{"$f":"IF(Conversions!C334<>0,Conversions!E334,\"\")","v":""},null,null,{"$f":"IF(Conversions!J392=TRUE,\"Y\",\"N\")","v":"N"},null,{"$f":"IF(Conversions!C334<>0,Conversions!O334,\"\")","v":""}]
[null,{"$f":"IF(Debts!B73=\"\",\"\",Debts!B73)","v":""},null,null,null,null,null,null,null,{"$f":"IF(Debts!D73<>0,Debts!D73,\"\")","v":""},null,null,null,{"$f":"IF(Conversions!H234<>0,Conversions!H234,\"\")","v":""},null,null,null,{"$f":"IF(Debts!B177=\"\",\"\",Debts!B177)","v":""},null,null,null,null,null,null,{"$f":"IF(Conversions!C335<>0,Conversions!E335,\"\")","v":""},null,null,{"$f":"IF(Conversions!J393=TRUE,\"Y\",\"N\")","v":"N"},null,{"$f":"IF(Conversions!C335<>0,Conversions!O335,\"\")","v":""}]
[null,{"$f":"IF(Debts!B74=\"\",\"\",Debts!B74)","v":""},null,null,null,null,null,null,null,{"$f":"IF(Debts!D74<>0,Debts!D74,\"\")","v":""},null,null,null,{"$f":"IF(Conversions!H235<>0,Conversions!H235,\"\")","v":""},null,null,null,{"$f":"IF(Debts!B178=\"\",\"\",Debts!B178)","v":""},null,null,null,null,null,null,{"$f":"IF(Conversions!C336<>0,Conversions!E336,\"\")","v":""},null,null,{"$f":"IF(Conversions!J394=TRUE,\"Y\",\"N\")","v":"N"},null,{"$f":"IF(Conversions!C336<>0,Conversions!O336,\"\")","v":""}]
[null,{"$f":"IF(Debts!B75=\"\",\"\",Debts!B75)","v":""},null,null,null,null,null,null,null,{"$f":"IF(Debts!D75<>0,Debts!D75,\"\")","v":""},null,null,null,{"$f":"IF(Conversions!H236<>0,Conversions!H236,\"\")","v":""},null,null,null,{"$f":"IF(Debts!B179=\"\",\"\",Debts!B179)","v":""},null,null,null,null,null,null,{"$f":"IF(Conversions!C337<>0,Conversions!E337,\"\")","v":""},null,null,{"$f":"IF(Conversions!J395=TRUE,\"Y\",\"N\")","v":"N"},null,{"$f":"IF(Conversions!C337<>0,Conversions!O337,\"\")","v":""}]
[null,{"$f":"IF(Debts!B76=\"\",\"\",Debts!B76)","v":""},null,null,null,null,null,null,null,{"$f":"IF(Debts!D76<>0,Debts!D76,\"\")","v":""},null,null,null,{"$f":"IF(Conversions!H237<>0,Conversions!H237,\"\")","v":""},null,null,null,{"$f":"IF(Debts!B180=\"\",\"\",Debts!B180)","v":""},null,null,null,null,null,null,{"$f":"IF(Conversions!C338<>0,Conversions!E338,\"\")","v":""},null,null,{"$f":"IF(Conversions!J396=TRUE,\"Y\",\"N\")","v":"N"},null,{"$f":"IF(Conversions!C338<>0,Conversions!O338,\"\")","v":""}]
[null,{"$f":"IF(Debts!B77=\"\",\"\",Debts!B77)","v":""},null,null,null,null,null,null,null,{"$f":"IF(Debts!D77<>0,Debts!D77,\"\")","v":""},null,null,null,{"$f":"IF(Conversions!H238<>0,Conversions!H238,\"\")","v":""},null,null,null,{"$f":"IF(Debts!B181=\"\",\"\",Debts!B181)","v":""},null,null,null,null,null,null,{"$f":"IF(Conversions!C339<>0,Conversions!E339,\"\")","v":""},null,null,{"$f":"IF(Conversions!J397=TRUE,\"Y\",\"N\")","v":"N"},null,{"$f":"IF(Conversions!C339<>0,Conversions!O339,\"\")","v":""}]
[null,{"$f":"IF(Debts!B78=\"\",\"\",Debts!B78)","v":""},null,null,null,null,null,null,null,{"$f":"IF(Debts!D78<>0,Debts!D78,\"\")","v":""},null,null,null,{"$f":"IF(Conversions!H239<>0,Conversions!H239,\"\")","v":""},null,null,null,{"$f":"IF(Debts!B182=\"\",\"\",Debts!B182)","v":""},null,null,null,null,null,null,{"$f":"IF(Conversions!C340<>0,Conversions!E340,\"\")","v":""},null,null,{"$f":"IF(Conversions!J398=TRUE,\"Y\",\"N\")","v":"N"},null,{"$f":"IF(Conversions!C340<>0,Conversions!O340,\"\")","v":""}]
[null,{"$f":"IF(Debts!B79=\"\",\"\",Debts!B79)","v":""},null,null,null,null,null,null,null,{"$f":"IF(Debts!D79<>0,Debts!D79,\"\")","v":""},null,null,null,{"$f":"IF(Conversions!H240<>0,Conversions!H240,\"\")","v":""},null,null,null,{"$f":"IF(Debts!B183=\"\",\"\",Debts!B183)","v":""},null,null,null,null,null,null,{"$f":"IF(Conversions!C341<>0,Conversions!E341,\"\")","v":""},null,null,{"$f":"IF(Conversions!J399=TRUE,\"Y\",\"N\")","v":"N"},null,{"$f":"IF(Conversions!C341<>0,Conversions!O341,\"\")","v":""}]
[null,{"$f":"IF(Debts!B80=\"\",\"\",Debts!B80)","v":""},null,null,null,null,null,null,null,{"$f":"IF(Debts!D80<>0,Debts!D80,\"\")","v":""},null,null,null,{"$f":"IF(Conversions!H241<>0,Conversions!H241,\"\")","v":""},null,null,null,{"$f":"IF(Debts!B184=\"\",\"\",Debts!B184)","v":""},null,null,null,null,null,null,{"$f":"IF(Conversions!C342<>0,Conversions!E342,\"\")","v":""},null,null,{"$f":"IF(Conversions!J400=TRUE,\"Y\",\"N\")","v":"N"},null,{"$f":"IF(Conversions!C342<>0,Conversions!O342,\"\")","v":""}]
[null,{"$f":"IF(Debts!B81=\"\",\"\",Debts!B81)","v":""},null,null,null,null,null,null,null,{"$f":"IF(Debts!D81<>0,Debts!D81,\"\")","v":""},null,null,null,{"$f":"IF(Conversions!H242<>0,Conversions!H242,\"\")","v":""},null,null,null,{"$f":"IF(Debts!B185=\"\",\"\",Debts!B185)","v":""},null,null,null,null,null,null,{"$f":"IF(Conversions!C343<>0,Conversions!E343,\"\")","v":""},null,null,{"$f":"IF(Conversions!J401=TRUE,\"Y\",\"N\")","v":"N"},null,{"$f":"IF(Conversions!C343<>0,Conversions!O343,\"\")","v":""}]
[null,{"$f":"IF(Debts!B82=\"\",\"\",Debts!B82)","v":""},null,null,null,null,null,null,null,{"$f":"IF(Debts!D82<>0,Debts!D82,\"\")","v":""},null,null,null,{"$f":"IF(Conversions!H243<>0,Conversions!H243,\"\")","v":""},null,null,null,{"$f":"IF(Debts!B186=\"\",\"\",Debts!B186)","v":""},null,null,null,null,null,null,{"$f":"IF(Conversions!C344<>0,Conversions!E344,\"\")","v":""},null,null,{"$f":"IF(Conversions!J402=TRUE,\"Y\",\"N\")","v":"N"},null,{"$f":"IF(Conversions!C344<>0,Conversions!O344,\"\")","v":""}]
[null,{"$f":"IF(Debts!B83=\"\",\"\",Debts!B83)","v":""},null,null,null,null,null,null,null,{"$f":"IF(Debts!D83<>0,Debts!D83,\"\")","v":""},null,null,null,{"$f":"IF(Conversions!H244<>0,Conversions!H244,\"\")","v":""},null,null,null,{"$f":"IF(Debts!B187=\"\",\"\",Debts!B187)","v":""},null,null,null,null,null,null,{"$f":"IF(Conversions!C345<>0,Conversions!E345,\"\")","v":""},null,null,{"$f":"IF(Conversions!J403=TRUE,\"Y\",\"N\")","v":"N"},null,{"$f":"IF(Conversions!C345<>0,Conversions!O345,\"\")","v":""}]
[null,{"$f":"IF(Debts!B84=\"\",\"\",Debts!B84)","v":""},null,null,null,null,null,null,null,{"$f":"IF(Debts!D84<>0,Debts!D84,\"\")","v":""},null,null,null,{"$f":"IF(Conversions!H245<>0,Conversions!H245,\"\")","v":""},null,null,null,{"$f":"IF(Debts!B188=\"\",\"\",Debts!B188)","v":""},null,null,null,null,null,null,{"$f":"IF(Conversions!C346<>0,Conversions!E346,\"\")","v":""},null,null,{"$f":"IF(Conversions!J404=TRUE,\"Y\",\"N\")","v":"N"},null,{"$f":"IF(Conversions!C346<>0,Conversions!O346,\"\")","v":""}]
[null,{"$f":"IF(Debts!B85=\"\",\"\",Debts!B85)","v":""},null,null,null,null,null,null,null,{"$f":"IF(Debts!D85<>0,Debts!D85,\"\")","v":""},null,null,null,{"$f":"IF(Conversions!H246<>0,Conversions!H246,\"\")","v":""},null,null,null,{"$f":"IF(Debts!B189=\"\",\"\",Debts!B189)","v":""},null,null,null,null,null,null,{"$f":"IF(Conversions!C347<>0,Conversions!E347,\"\")","v":""},null,null,{"$f":"IF(Conversions!J405=TRUE,\"Y\",\"N\")","v":"N"},null,{"$f":"IF(Conversions!C347<>0,Conversions!O347,\"\")","v":""}]
[null,{"$f":"IF(Debts!B86=\"\",\"\",Debts!B86)","v":""},null,null,null,null,null,null,null,{"$f":"IF(Debts!D86<>0,Debts!D86,\"\")","v":""},null,null,null,{"$f":"IF(Conversions!H247<>0,Conversions!H247,\"\")","v":""},null,null,null,{"$f":"IF(Debts!B190=\"\",\"\",Debts!B190)","v":""},null,null,null,null,null,null,{"$f":"IF(Conversions!C348<>0,Conversions!E348,\"\")","v":""},null,null,{"$f":"IF(Conversions!J406=TRUE,\"Y\",\"N\")","v":"N"},null,{"$f":"IF(Conversions!C348<>0,Conversions!O348,\"\")","v":""}]
[null,{"$f":"IF(Debts!B87=\"\",\"\",Debts!B87)","v":""},null,null,null,null,null,null,null,{"$f":"IF(Debts!D87<>0,Debts!D87,\"\")","v":""},null,null,null,{"$f":"IF(Conversions!H248<>0,Conversions!H248,\"\")","v":""},null,null,null,{"$f":"IF(Debts!B191=\"\",\"\",Debts!B191)","v":""},null,null,null,null,null,null,{"$f":"IF(Conversions!C349<>0,Conversions!E349,\"\")","v":""},null,null,{"$f":"IF(Conversions!J407=TRUE,\"Y\",\"N\")","v":"N"},null,{"$f":"IF(Conversions!C349<>0,Conversions!O349,\"\")","v":""}]
[null,{"$f":"IF(Debts!B88=\"\",\"\",Debts!B88)","v":""},null,null,null,null,null,null,null,{"$f":"IF(Debts!D88<>0,Debts!D88,\"\")","v":""},null,null,null,{"$f":"IF(Conversions!H249<>0,Conversions!H249,\"\")","v":""},null,null,null,{"$f":"IF(Debts!B192=\"\",\"\",Debts!B192)","v":""},null,null,null,null,null,null,{"$f":"IF(Conversions!C350<>0,Conversions!E350,\"\")","v":""},null,null,{"$f":"IF(Conversions!J408=TRUE,\"Y\",\"N\")","v":"N"},null,{"$f":"IF(Conversions!C350<>0,Conversions!O350,\"\")","v":""}]
[null,{"$f":"IF(Debts!B89=\"\",\"\",Debts!B89)","v":""},null,null,null,null,null,null,null,{"$f":"IF(Debts!D89<>0,Debts!D89,\"\")","v":""},null,null,null,{"$f":"IF(Conversions!H250<>0,Conversions!H250,\"\")","v":""},null,null,null,{"$f":"IF(Debts!B193=\"\",\"\",Debts!B193)","v":""},null,null,null,null,null,null,{"$f":"IF(Conversions!C351<>0,Conversions!E351,\"\")","v":""},null,null,{"$f":"IF(Conversions!J409=TRUE,\"Y\",\"N\")","v":"N"},null,{"$f":"IF(Conversions!C351<>0,Conversions!O351,\"\")","v":""}]
[null,{"$f":"IF(Debts!B90=\"\",\"\",Debts!B90)","v":""},null,null,null,null,null,null,null,{"$f":"IF(Debts!D90<>0,Debts!D90,\"\")","v":""},null,null,null,{"$f":"IF(Conversions!H251<>0,Conversions!H251,\"\")","v":""},null,null,null,{"$f":"IF(Debts!B194=\"\",\"\",Debts!B194)","v":""},null,null,null,null,null,null,{"$f":"IF(Conversions!C352<>0,Conversions!E352,\"\")","v":""},null,null,{"$f":"IF(Conversions!J410=TRUE,\"Y\",\"N\")","v":"N"},null,{"$f":"IF(Conversions!C352<>0,Conversions!O352,\"\")","v":""}]
[null,{"$f":"IF(Debts!B91=\"\",\"\",Debts!B91)","v":""},null,null,null,null,null,null,null,{"$f":"IF(Debts!D91<>0,Debts!D91,\"\")","v":""},null,null,null,{"$f":"IF(Conversions!H252<>0,Conversions!H252,\"\")","v":""},null,null,null,{"$f":"IF(Debts!B195=\"\",\"\",Debts!B195)","v":""},null,null,null,null,null,null,{"$f":"IF(Conversions!C353<>0,Conversions!E353,\"\")","v":""},null,null,{"$f":"IF(Conversions!J411=TRUE,\"Y\",\"N\")","v":"N"},null,{"$f":"IF(Conversions!C353<>0,Conversions!O353,\"\")","v":""}]
[null,{"$f":"IF(Debts!B92=\"\",\"\",Debts!B92)","v":""},null,null,null,null,null,null,null,{"$f":"IF(Debts!D92<>0,Debts!D92,\"\")","v":""},null,null,null,{"$f":"IF(Conversions!H253<>0,Conversions!H253,\"\")","v":""},null,null,null,{"$f":"IF(Debts!B196=\"\",\"\",Debts!B196)","v":""},null,null,null,null,null,null,{"$f":"IF(Conversions!C354<>0,Conversions!E354,\"\")","v":""},null,null,{"$f":"IF(Conversions!J412=TRUE,\"Y\",\"N\")","v":"N"},null,{"$f":"IF(Conversions!C354<>0,Conversions!O354,\"\")","v":""}]
[null,{"$f":"IF(Debts!B93=\"\",\"\",Debts!B93)","v":""},null,null,null,null,null,null,null,{"$f":"IF(Debts!D93<>0,Debts!D93,\"\")","v":""},null,null,null,{"$f":"IF(Conversions!H254<>0,Conversions!H254,\"\")","v":""},null,null,null,{"$f":"IF(Debts!B197=\"\",\"\",Debts!B197)","v":""},null,null,null,null,null,null,{"$f":"IF(Conversions!C355<>0,Conversions!E355,\"\")","v":""},null,null,{"$f":"IF(Conversions!J413=TRUE,\"Y\",\"N\")","v":"N"},null,{"$f":"IF(Conversions!C355<>0,Conversions!O355,\"\")","v":""}]
[null,{"$f":"IF(Debts!B94=\"\",\"\",Debts!B94)","v":""},null,null,null,null,null,null,null,{"$f":"IF(Debts!D94<>0,Debts!D94,\"\")","v":""},null,null,null,{"$f":"IF(Conversions!H255<>0,Conversions!H255,\"\")","v":""},null,null,null,{"$f":"IF(Debts!B198=\"\",\"\",Debts!B198)","v":""},null,null,null,null,null,null,{"$f":"IF(Conversions!C356<>0,Conversions!E356,\"\")","v":""},null,null,{"$f":"IF(Conversions!J414=TRUE,\"Y\",\"N\")","v":"N"},null,{"$f":"IF(Conversions!C356<>0,Conversions!O356,\"\")","v":""}]
[null,{"$f":"IF(Debts!B95=\"\",\"\",Debts!B95)","v":""},null,null,null,null,null,null,null,{"$f":"IF(Debts!D95<>0,Debts!D95,\"\")","v":""},null,null,null,{"$f":"IF(Conversions!H256<>0,Conversions!H256,\"\")","v":""},null,null,null,{"$f":"IF(Debts!B199=\"\",\"\",Debts!B199)","v":""},null,null,null,null,null,null,{"$f":"IF(Conversions!C357<>0,Conversions!E357,\"\")","v":""},null,null,{"$f":"IF(Conversions!J415=TRUE,\"Y\",\"N\")","v":"N"},null,{"$f":"IF(Conversions!C357<>0,Conversions!O357,\"\")","v":""}]
[null,{"$f":"IF(Debts!B96=\"\",\"\",Debts!B96)","v":""},null,null,null,null,null,null,null,{"$f":"IF(Debts!D96<>0,Debts!D96,\"\")","v":""},null,null,null,{"$f":"IF(Conversions!H257<>0,Conversions!H257,\"\")","v":""},null,null,null,{"$f":"IF(Debts!B200=\"\",\"\",Debts!B200)","v":""},null,null,null,null,null,null,{"$f":"IF(Conversions!C358<>0,Conversions!E358,\"\")","v":""},null,null,{"$f":"IF(Conversions!J416=TRUE,\"Y\",\"N\")","v":"N"},null,{"$f":"IF(Conversions!C358<>0,Conversions!O358,\"\")","v":""}]
[null,{"$f":"IF(Debts!B97=\"\",\"\",Debts!B97)","v":""},null,null,null,null,null,null,null,{"$f":"IF(Debts!D97<>0,Debts!D97,\"\")","v":""},null,null,null,{"$f":"IF(Conversions!H258<>0,Conversions!H258,\"\")","v":""},null,null,null,{"$f":"IF(Debts!B201=\"\",\"\",Debts!B201)","v":""},null,null,null,null,null,null,{"$f":"IF(Conversions!C359<>0,Conversions!E359,\"\")","v":""},null,null,{"$f":"IF(Conversions!J417=TRUE,\"Y\",\"N\")","v":"N"},null,{"$f":"IF(Conversions!C359<>0,Conversions!O359,\"\")","v":""}]
[null,{"$f":"IF(Debts!B98=\"\",\"\",Debts!B98)","v":""},null,null,null,null,null,null,null,{"$f":"IF(Debts!D98<>0,Debts!D98,\"\")","v":""},null,null,null,{"$f":"IF(Conversions!H259<>0,Conversions!H259,\"\")","v":""},null,null,null,{"$f":"IF(Debts!B202=\"\",\"\",Debts!B202)","v":""},null,null,null,null,null,null,{"$f":"IF(Conversions!C360<>0,Conversions!E360,\"\")","v":""},null,null,{"$f":"IF(Conversions!J418=TRUE,\"Y\",\"N\")","v":"N"},null,{"$f":"IF(Conversions!C360<>0,Conversions!O360,\"\")","v":""}]
[null,{"$f":"IF(Debts!B99=\"\",\"\",Debts!B99)","v":""},null,null,null,null,null,null,null,{"$f":"IF(Debts!D99<>0,Debts!D99,\"\")","v":""},null,null,null,{"$f":"IF(Conversions!H260<>0,Conversions!H260,\"\")","v":""},null,null,null,{"$f":"IF(Debts!B203=\"\",\"\",Debts!B203)","v":""},null,null,null,null,null,null,{"$f":"IF(Conversions!C361<>0,Conversions!E361,\"\")","v":""},null,null,{"$f":"IF(Conversions!J419=TRUE,\"Y\",\"N\")","v":"N"},null,{"$f":"IF(Conversions!C361<>0,Conversions!O361,\"\")","v":""}]
[null,{"$f":"IF(Debts!B100=\"\",\"\",Debts!B100)","v":""},null,null,null,null,null,null,null,{"$f":"IF(Debts!D100<>0,Debts!D100,\"\")","v":""},null,null,null,{"$f":"IF(Conversions!H261<>0,Conversions!H261,\"\")","v":""},null,null,null,{"$f":"IF(Debts!B204=\"\",\"\",Debts!B204)","v":""},null,null,null,null,null,null,{"$f":"IF(Conversions!C362<>0,Conversions!E362,\"\")","v":""},null,null,{"$f":"IF(Conversions!J420=TRUE,\"Y\",\"N\")","v":"N"},null,{"$f":"IF(Conversions!C362<>0,Conversions!O362,\"\")","v":""}]
[null,{"$f":"IF(Debts!B101=\"\",\"\",Debts!B101)","v":""},null,null,null,null,null,null,null,{"$f":"IF(Debts!D101<>0,Debts!D101,\"\")","v":""},null,null,null,{"$f":"IF(Conversions!H262<>0,Conversions!H262,\"\")","v":""},null,null,null,{"$f":"IF(Debts!B205=\"\",\"\",Debts!B205)","v":""},null,null,null,null,null,null,{"$f":"IF(Conversions!C363<>0,Conversions!E363,\"\")","v":""},null,null,{"$f":"IF(Conversions!J421=TRUE,\"Y\",\"N\")","v":"N"},null,{"$f":"IF(Conversions!C363<>0,Conversions!O363,\"\")","v":""}]
[]
[]
[null,null,"Total Priority debts",null,null,null,null,null,null,{"$f":"SUM(J147:L198)+J124","v":0},null,null,null,{"$f":"SUM(N147:P198)+N124","v":0},null,null,null,"Total Non - Priority debts",null,null,null,null,null,null,{"$f":"SUM(Y147:AA198)+Y124","v":0},null,null,null,null,{"$f":"SUM(AD147:AF198)+AD124","v":0}]
[]
[]
[]
[]
[]
[]
[]
[]
[null,{"$f":"Notes!E2","v":"Additional notes (e.g. Reasons for debt, circumstances, temporary situations)\nPLEASE NOTE: previous comments will be shown here, please add further notes at the bottom - click show continuation sheet for all notes."}]
[null,{"$f":"IF(Notes!E7=\"\",\"\",Notes!E7)","v":"Reasons for debt, client circumstances or vulnerabilities, temporary situations, detail regarding benefits or repayment terms:"}]
[null,{"$f":"IF(Notes!E8=\"\",\"\",Notes!E8)","v":""}]
[]
[]
[]
[]
[]
[null,{"$f":"IF(Notes!E9=\"\",\"\",Notes!E9)","v":""}]
[null,{"$f":"IF(Notes!E15=\"\",\"\",Notes!E15)","v":"Additional Notes: "}]
[null,{"$f":"IF(Notes!E11=\"\",\"\",Notes!E11)","v":""}]
[null,{"$f":"IF(Notes!E12=\"\",\"\",Notes!E12)","v":""}]
[null,{"$f":"IF(Notes!E18=\"\",\"\",Notes!E18)","v":"Notes:"}]
[null,{"$f":"IF(Notes!E19=\"\",\"\",Notes!E19)","v":""}]
[null,{"$f":"IF(Notes!E20=\"\",\"\",Notes!E20)","v":""}]
[null,{"$f":"IF(Notes!E21=\"\",\"\",Notes!E21)","v":""}]
[null,{"$f":"IF(Notes!E22=\"\",\"\",Notes!E22)","v":""}]
[null,{"$f":"IF(Notes!E23=\"\",\"\",Notes!E23)","v":""}]
[null,{"$f":"IF(Notes!E24=\"\",\"\",Notes!E24)","v":""}]
[null,{"$f":"IF(Notes!E25=\"\",\"\",Notes!E25)","v":""}]
[null,{"$f":"IF(Notes!E26=\"\",\"\",Notes!E26)","v":""}]
[null,{"$f":"IF(Notes!E27=\"\",\"\",Notes!E27)","v":""}]
[null,{"$f":"IF(Notes!E28=\"\",\"\",Notes!E28)","v":""}]
[null,{"$f":"IF(Notes!E29=\"\",\"\",Notes!E29)","v":""}]
[null,{"$f":"IF(Notes!E30=\"\",\"\",Notes!E30)","v":""}]
[null,{"$f":"IF(Notes!E31=\"\",\"\",Notes!E31)","v":""}]
[null,{"$f":"IF(Notes!E32=\"\",\"\",Notes!E32)","v":""}]
[null,{"$f":"IF(Notes!E33=\"\",\"\",Notes!E33)","v":""}]
[null,{"$f":"IF(Notes!E34=\"\",\"\",Notes!E34)","v":""}]
[null,{"$f":"IF(Notes!E35=\"\",\"\",Notes!E35)","v":""}]
[null,{"$f":"IF(Notes!E36=\"\",\"\",Notes!E36)","v":""}]
[null,{"$f":"IF(Notes!E37=\"\",\"\",Notes!E37)","v":""}]
[null,{"$f":"IF(Notes!E38=\"\",\"\",Notes!E38)","v":""}]
[null,{"$f":"IF(Notes!E39=\"\",\"\",Notes!E39)","v":""}]
[null,{"$f":"IF(Notes!E40=\"\",\"\",Notes!E40)","v":""}]
[null,{"$f":"IF(Notes!E41=\"\",\"\",Notes!E41)","v":""}]
[null,{"$f":"IF(Notes!E42=\"\",\"\",Notes!E42)","v":""}]
[null,{"$f":"IF(Notes!E43=\"\",\"\",Notes!E43)","v":""}]
[null,{"$f":"IF(Notes!E44=\"\",\"\",Notes!E44)","v":""}]
[null,{"$f":"IF(Notes!E45=\"\",\"\",Notes!E45)","v":""}]
[null,{"$f":"IF(Notes!E46=\"\",\"\",Notes!E46)","v":""}]
[null,{"$f":"IF(Notes!E47=\"\",\"\",Notes!E47)","v":""}]
[null,{"$f":"IF(Notes!E48=\"\",\"\",Notes!E48)","v":""}]
[null,{"$f":"IF(Notes!E49=\"\",\"\",Notes!E49)","v":""}]
[null,{"$f":"IF(Notes!E50=\"\",\"\",Notes!E50)","v":""}]
[null,{"$f":"IF(Notes!E51=\"\",\"\",Notes!E51)","v":""}]
[null,{"$f":"IF(Notes!E52=\"\",\"\",Notes!E52)","v":""}]
[null,{"$f":"IF(Notes!E53=\"\",\"\",Notes!E53)","v":""}]
[null,{"$f":"IF(Notes!E54=\"\",\"\",Notes!E54)","v":""}]

{"sheet":"Detailed Statement v2.0","index":11,"n_rows":691,"n_cols":32,"rows_kept":691,"cut":false,"hidden":false,"merged":[[30,12,30,14],[30,16,30,31],[574,1,574,31],[575,1,575,31],[576,1,576,31],[577,1,577,31],[578,1,578,31],[579,1,579,31],[580,1,580,31],[581,1,581,31],[582,1,582,31],[583,1,583,31],[584,1,584,31],[585,1,585,31],[586,1,586,31],[587,1,587,31],[149,1,149,11],[150,1,150,11],[151,1,151,11],[152,1,152,11],[153,1,153,11],[154,1,154,11],[149,12,149,14],[150,12,150,14],[151,12,151,14],[152,12,152,14],[153,12,153,14],[154,12,154,14],[149,16,149,31],[150,16,150,31],[151,16,151,31],[209,1,209,11],[588,1,588,31],[271,29,271,31],[271,13,271,15],[205,25,205,30],[190,12,190,14],[191,12,191,14],[192,12,192,14],[270,1,270,12],[270,17,270,28],[270,13,270,15],[270,29,270,31],[271,2,271,8],[271,9,271,11],[271,17,271,23],[271,24,271,26],[205,1,205,24],[377,1,377,31],[378,1,378,31],[367,1,367,31],[356,1,356,31],[357,1,357,31],[358,1,358,31],[258,1,258,7],[258,9,258,11],[258,13,258,15],[258,17,258,23],[258,24,258,26],[258,27,258,28],[258,29,258,31],[263,29,263,31],[264,1,264,7],[264,9,264,11],[589,1,589,31],[198,1,198,11],[201,1,201,31],[196,1,196,31],[194,1,194,11],[190,1,190,11],[191,1,191,11],[192,1,192,11],[193,1,193,11],[198,12,198,15],[197,12,197,15],[265,29,265,31],[268,24,268,26],[267,1,267,7],[265,24,265,26],[265,27,265,28],[569,1,569,31],[570,1,570,31],[571,1,571,31],[572,1,572,31],[573,1,573,31],[194,12,194,14],[379,1,379,31],[380,1,380,31],[381,1,381,31],[382,1,382,31],[383,1,383,31],[384,1,384,31],[373,1,373,31],[374,1,374,31],[375,1,375,31],[376,1,376,31],[153,16,153,31],[154,16,154,31],[208,1,208,31],[209,12,209,16],[210,12,210,16],[209,18,209,33],[210,18,210,33],[273,24,273,26],[203,12,203,16],[202,12,202,16],[269,27,269,28],[269,29,269,31],[265,1,265,7],[265,9,265,11],[265,13,265,15],[265,17,265,23],[268,27,268,28],[268,29,268,31],[269,1,269,7],[269,9,269,11],[269,13,269,15],[269,17,269,23],[269,24,269,26],[261,29,261,31],[189,12,189,14],[195,16,195,31],[190,16,190,31],[191,16,191,31],[192,16,192,31],[193,16,193,31],[194,16,194,31],[193,12,193,14],[187,1,187,11],[179,1,179,11],[180,1,180,11],[181,1,181,11],[182,1,182,11],[183,1,183,11],[174,16,174,31],[168,12,168,14],[169,12,169,14],[170,12,170,14],[171,12,171,14],[174,12,174,14],[178,12,178,14],[178,16,178,31],[175,12,175,14],[186,12,186,14],[187,12,187,14],[179,16,179,31],[180,16,180,31],[181,16,181,31],[185,1,185,11],[186,1,186,11],[186,16,186,31],[168,1,168,11],[177,16,177,31],[185,12,185,14],[182,16,182,31],[183,16,183,31],[184,16,184,31],[185,16,185,31],[167,16,167,31],[168,16,168,31],[169,16,169,31],[170,16,170,31],[171,16,171,31],[172,16,172,31],[173,16,173,31],[172,12,172,14],[173,12,173,14],[167,12,167,14],[189,16,189,31],[156,16,156,31],[157,16,157,31],[157,12,157,14],[158,12,158,14],[159,12,159,14],[160,12,160,14],[161,12,161,14],[158,16,158,31],[159,16,159,31],[160,16,160,31],[156,12,156,14],[140,16,140,31],[141,16,141,31],[142,16,142,31],[143,16,143,31],[144,16,144,31],[145,16,145,31],[152,16,152,31],[146,16,146,31],[137,12,137,14],[138,12,138,14],[134,16,134,31],[135,16,135,31],[136,16,136,31],[137,16,137,31],[141,12,141,14],[142,12,142,14],[143,12,143,14],[135,12,135,14],[136,12,136,14],[144,12,144,14],[145,12,145,14],[134,12,134,14],[140,12,140,14],[147,12,147,14],[143,1,143,11],[144,1,144,11],[145,1,145,11],[146,1,146,11],[146,12,146,14],[155,1,155,11],[147,1,147,11],[161,1,161,11],[183,12,183,14],[184,12,184,14],[177,12,177,14],[179,12,179,14],[180,12,180,14],[160,1,160,11],[156,1,156,11],[157,1,157,11],[158,1,158,11],[159,1,159,11],[184,1,184,11],[169,1,169,10],[170,1,170,10],[171,1,171,10],[172,1,172,10],[173,1,173,10],[174,1,174,10],[181,12,181,14],[182,12,182,14],[175,1,175,10],[178,1,178,11],[124,16,124,31],[123,12,123,14],[123,16,123,31],[119,1,119,11],[116,1,116,11],[117,1,117,11],[118,1,118,11],[117,16,117,31],[118,16,118,31],[116,16,116,31],[130,12,130,14],[131,12,131,14],[132,12,132,14],[125,16,125,31],[126,16,126,31],[127,16,127,31],[128,16,128,31],[129,16,129,31],[130,16,130,31],[131,16,131,31],[132,16,132,31],[125,12,125,14],[126,12,126,14],[127,12,127,14],[128,12,128,14],[129,12,129,14],[126,1,126,11],[127,1,127,11],[128,1,128,11],[129,1,129,11],[130,1,130,11],[131,1,131,11],[119,16,119,31],[120,16,120,31],[122,1,122,11],[123,1,123,11],[91,16,91,31],[103,1,103,11],[104,1,104,11],[105,1,105,11],[106,1,106,11],[107,1,107,11],[108,1,108,11],[109,1,109,11],[95,1,95,11],[96,1,96,11],[97,1,97,11],[98,1,98,11],[99,1,99,11],[100,1,100,11],[101,1,101,11],[102,1,102,11],[94,1,94,11],[120,1,120,11],[121,1,121,11],[116,12,116,14],[117,12,117,14],[118,12,118,14],[119,12,119,14],[120,12,120,14],[121,12,121,14],[101,16,101,31],[102,16,102,31],[103,16,103,31],[125,1,125,11],[124,12,124,14],[142,1,142,11],[134,1,134,11],[135,1,135,11],[136,1,136,11],[137,1,137,11],[138,1,138,11],[140,1,140,11],[141,1,141,11],[132,1,132,11],[133,1,133,11],[82,1,82,11],[83,1,83,11],[109,16,109,31],[114,12,114,14],[115,12,115,14],[114,16,114,31],[115,16,115,31],[115,1,115,11],[94,16,94,31],[95,16,95,31],[96,16,96,31],[97,16,97,31],[98,16,98,31],[95,12,95,14],[96,12,96,14],[97,12,97,14],[98,12,98,14],[94,12,94,14],[114,1,114,11],[110,1,110,11],[67,1,67,11],[68,1,68,11],[69,1,69,11],[56,1,56,11],[88,16,88,31],[89,16,89,31],[90,16,90,31],[88,1,88,11],[50,1,50,11],[51,1,51,11],[52,1,52,11],[53,1,53,11],[87,1,87,11],[87,16,87,31],[212,1,212,11],[82,12,82,14],[83,12,83,14],[84,12,84,14],[85,12,85,14],[86,12,86,14],[87,12,87,14],[92,12,92,14],[88,12,88,14],[89,12,89,14],[90,12,90,14],[91,12,91,14],[99,12,99,14],[102,12,102,14],[103,12,103,14],[104,12,104,14],[101,12,101,14],[124,1,124,11],[46,1,46,11],[47,1,47,11],[48,1,48,11],[49,1,49,11],[82,16,82,31],[83,16,83,31],[84,16,84,31],[85,16,85,31],[86,16,86,31],[54,1,54,11],[55,1,55,11],[54,16,54,31],[55,16,55,31],[76,16,76,31],[63,12,63,14],[64,1,64,11],[47,12,47,14],[48,12,48,14],[48,16,48,31],[49,16,49,31],[49,12,49,14],[47,16,47,31],[54,12,54,14],[79,1,79,11],[80,1,80,11],[84,1,84,11],[85,1,85,11],[72,12,72,14],[73,12,73,14],[74,12,74,14],[75,12,75,14],[76,12,76,14],[35,1,35,11],[35,16,35,31],[42,12,42,14],[43,12,43,14],[44,12,44,14],[45,12,45,14],[39,1,39,11],[35,12,35,14],[40,1,40,11],[41,1,41,11],[44,16,44,31],[45,16,45,31],[42,16,42,31],[43,16,43,31],[42,1,42,11],[43,1,43,11],[44,1,44,11],[45,1,45,11],[38,16,38,31],[39,16,39,31],[65,1,65,11],[66,1,66,11],[86,1,86,11],[55,12,55,14],[66,16,66,31],[67,16,67,31],[68,16,68,31],[69,16,69,31],[266,1,266,7],[266,9,266,11],[266,13,266,15],[266,17,266,23],[266,24,266,26],[266,27,266,28],[267,29,267,31],[268,1,268,7],[268,9,268,11],[268,13,268,15],[268,17,268,23],[266,29,266,31],[267,9,267,11],[267,13,267,15],[267,17,267,23],[267,24,267,26],[267,27,267,28],[259,24,259,26],[259,27,259,28],[259,29,259,31],[260,1,260,7],[260,9,260,11],[260,13,260,15],[77,12,77,14],[264,13,264,15],[264,17,264,23],[264,24,264,26],[264,27,264,28],[264,29,264,31],[263,1,263,7],[371,1,371,31],[372,1,372,31],[361,1,361,31],[362,1,362,31],[363,1,363,31],[364,1,364,31],[359,1,359,31],[360,1,360,31],[352,1,352,31],[368,1,368,31],[369,1,369,31],[370,1,370,31],[353,1,353,31],[354,1,354,31],[355,1,355,31],[365,1,365,31],[366,1,366,31],[281,1,281,7],[281,9,281,11],[281,13,281,15],[281,17,281,23],[281,24,281,26],[281,27,281,28],[281,29,281,31],[282,1,282,7],[282,9,282,11],[260,17,260,23],[263,27,263,28],[259,1,259,7],[259,9,259,11],[259,13,259,15],[260,24,260,26],[260,27,260,28],[260,29,260,31],[261,1,261,7],[261,9,261,11],[261,13,261,15],[261,17,261,23],[261,24,261,26],[261,27,261,28],[259,17,259,23],[263,9,263,11],[263,13,263,15],[263,17,263,23],[263,24,263,26],[262,1,262,7],[262,9,262,11],[262,13,262,15],[262,17,262,23],[262,24,262,26],[262,27,262,28],[262,29,262,31],[257,29,257,31],[257,1,257,7],[257,9,257,11],[257,13,257,15],[257,17,257,23],[257,24,257,26],[257,27,257,28],[255,29,255,31],[256,1,256,7],[256,9,256,11],[256,13,256,15],[256,17,256,23],[256,24,256,26],[256,27,256,28],[256,29,256,31],[255,1,255,7],[255,9,255,11],[255,13,255,15],[255,17,255,23],[255,24,255,26],[255,27,255,28],[253,29,253,31],[254,1,254,7],[254,9,254,11],[254,13,254,15],[254,17,254,23],[254,24,254,26],[254,27,254,28],[254,29,254,31],[253,1,253,7],[253,9,253,11],[253,13,253,15],[253,17,253,23],[253,24,253,26],[253,27,253,28],[251,29,251,31],[252,1,252,7],[252,9,252,11],[252,13,252,15],[252,17,252,23],[252,24,252,26],[252,27,252,28],[252,29,252,31],[251,1,251,7],[251,9,251,11],[251,13,251,15],[251,17,251,23],[251,24,251,26],[251,27,251,28],[249,29,249,31],[250,1,250,7],[250,9,250,11],[250,13,250,15],[250,17,250,23],[250,24,250,26],[250,27,250,28],[250,29,250,31],[249,1,249,7],[249,9,249,11],[249,13,249,15],[249,17,249,23],[249,24,249,26],[249,27,249,28],[247,29,247,31],[248,1,248,7],[248,9,248,11],[248,13,248,15],[248,17,248,23],[248,24,248,26],[248,27,248,28],[248,29,248,31],[247,1,247,7],[247,9,247,11],[247,13,247,15],[247,17,247,23],[247,24,247,26],[247,27,247,28],[245,29,245,31],[246,1,246,7],[246,9,246,11],[246,13,246,15],[246,17,246,23],[246,24,246,26],[246,27,246,28],[246,29,246,31],[245,1,245,7],[245,9,245,11],[245,13,245,15],[245,17,245,23],[245,24,245,26],[245,27,245,28],[243,29,243,31],[244,1,244,7],[244,9,244,11],[244,13,244,15],[244,17,244,23],[244,24,244,26],[244,27,244,28],[244,29,244,31],[243,1,243,7],[243,9,243,11],[243,13,243,15],[243,17,243,23],[243,24,243,26],[243,27,243,28],[241,29,241,31],[242,1,242,7],[242,9,242,11],[242,13,242,15],[242,17,242,23],[242,24,242,26],[242,27,242,28],[242,29,242,31],[241,1,241,7],[241,9,241,11],[241,13,241,15],[241,17,241,23],[241,24,241,26],[241,27,241,28],[239,29,239,31],[240,1,240,7],[240,9,240,11],[240,13,240,15],[240,17,240,23],[240,24,240,26],[240,27,240,28],[240,29,240,31],[239,1,239,7],[239,9,239,11],[239,13,239,15],[239,17,239,23],[239,24,239,26],[239,27,239,28],[237,29,237,31],[238,1,238,7],[238,9,238,11],[238,13,238,15],[238,17,238,23],[238,24,238,26],[238,27,238,28],[238,29,238,31],[237,1,237,7],[237,9,237,11],[237,13,237,15],[237,17,237,23],[237,24,237,26],[237,27,237,28],[235,29,235,31],[236,1,236,7],[236,9,236,11],[236,13,236,15],[236,17,236,23],[236,24,236,26],[236,27,236,28],[236,29,236,31],[235,1,235,7],[235,9,235,11],[235,13,235,15],[235,17,235,23],[235,24,235,26],[235,27,235,28],[233,29,233,31],[234,1,234,7],[234,9,234,11],[234,13,234,15],[234,17,234,23],[234,24,234,26],[234,27,234,28],[234,29,234,31],[233,1,233,7],[233,9,233,11],[233,13,233,15],[233,17,233,23],[233,24,233,26],[233,27,233,28],[231,29,231,31],[232,1,232,7],[232,9,232,11],[232,13,232,15],[232,17,232,23],[232,24,232,26],[232,27,232,28],[232,29,232,31],[231,1,231,7],[231,9,231,11],[231,13,231,15],[231,17,231,23],[231,24,231,26],[231,27,231,28],[229,29,229,31],[230,1,230,7],[230,9,230,11],[230,13,230,15],[230,17,230,23],[230,24,230,26],[230,27,230,28],[230,29,230,31],[229,1,229,7],[229,9,229,11],[229,13,229,15],[229,17,229,23],[229,24,229,26],[229,27,229,28],[227,29,227,31],[228,1,228,7],[228,9,228,11],[228,13,228,15],[228,17,228,23],[228,24,228,26],[228,27,228,28],[228,29,228,31],[227,1,227,7],[227,9,227,11],[227,13,227,15],[227,17,227,23],[227,24,227,26],[227,27,227,28],[225,29,225,31],[226,1,226,7],[226,9,226,11],[226,13,226,15],[226,17,226,23],[226,24,226,26],[226,27,226,28],[226,29,226,31],[225,1,225,7],[225,9,225,11],[225,13,225,15],[225,17,225,23],[225,24,225,26],[225,27,225,28],[223,29,223,31],[224,1,224,7],[224,9,224,11],[224,13,224,15],[224,17,224,23],[224,24,224,26],[224,27,224,28],[224,29,224,31],[223,1,223,7],[223,9,223,11],[223,13,223,15],[223,17,223,23],[223,24,223,26],[223,27,223,28],[219,29,219,31],[220,1,220,7],[220,9,220,11],[220,13,220,15],[220,17,220,23],[220,24,220,26],[220,27,220,28],[220,29,220,31],[219,1,219,7],[219,9,219,11],[219,13,219,15],[219,17,219,23],[219,24,219,26],[219,27,219,28],[222,1,222,7],[222,9,222,11],[222,13,222,15],[222,17,222,23],[222,24,222,26],[222,27,222,28],[222,29,222,31],[221,1,221,7],[221,9,221,11],[221,13,221,15],[221,17,221,23],[221,24,221,26],[221,27,221,28],[221,29,221,31],[217,29,217,31],[218,1,218,7],[218,9,218,11],[218,13,218,15],[218,17,218,23],[218,24,218,26],[218,27,218,28],[218,29,218,31],[60,16,60,31],[217,1,217,7],[217,9,217,11],[217,13,217,15],[217,17,217,23],[217,24,217,26],[217,27,217,28],[71,1,71,11],[72,1,72,11],[73,1,73,11],[74,1,74,11],[75,1,75,11],[76,1,76,11],[77,1,77,11],[78,1,78,11],[75,16,75,31],[65,16,65,31],[70,1,70,11],[66,12,66,14],[89,1,89,11],[90,1,90,11],[91,1,91,11],[92,1,92,11],[93,1,93,11],[73,16,73,31],[74,16,74,31],[59,16,59,31],[69,12,69,14],[64,12,64,14],[64,16,64,31],[65,12,65,14],[71,12,71,14],[67,12,67,14],[68,12,68,14],[50,12,50,14],[46,16,46,31],[51,12,51,14],[52,12,52,14],[53,12,53,14],[50,16,50,31],[51,16,51,31],[52,16,52,31],[53,16,53,31],[46,12,46,14],[70,16,70,31],[9,9,9,14],[9,23,9,28],[10,9,10,14],[10,23,10,28],[11,9,11,14],[11,23,11,30],[16,11,16,14],[19,13,20,15],[25,12,25,14],[26,12,26,14],[4,9,4,14],[5,9,5,14],[5,23,5,31],[6,9,6,14],[6,23,6,31],[7,9,7,14],[8,23,8,28],[8,9,8,14],[7,23,7,28],[282,13,282,15],[282,17,282,23],[282,24,282,26],[282,27,282,28],[282,29,282,31],[12,23,12,30],[13,23,13,30],[13,9,13,14],[14,23,14,30],[14,9,14,14],[15,11,15,14],[26,16,26,31],[31,12,31,14],[31,16,31,31],[32,16,32,31],[33,16,33,31],[27,12,27,14],[27,16,27,31],[28,12,28,14],[28,16,28,31],[29,12,29,14],[29,16,29,31],[34,12,34,14],[41,16,41,31],[39,12,39,14],[36,12,36,14],[37,12,37,14],[38,12,38,14],[36,16,36,31],[37,16,37,31],[71,16,71,31],[72,16,72,31],[285,1,285,7],[285,9,285,11],[285,13,285,15],[285,17,285,23],[285,24,285,26],[285,27,285,28],[285,29,285,31],[286,1,286,7],[286,9,286,11],[286,13,286,15],[286,17,286,23],[286,24,286,26],[286,27,286,28],[286,29,286,31],[283,1,283,7],[283,9,283,11],[283,13,283,15],[283,17,283,23],[283,24,283,26],[283,27,283,28],[283,29,283,31],[284,1,284,7],[284,9,284,11],[284,13,284,15],[284,17,284,23],[284,24,284,26],[284,27,284,28],[284,29,284,31],[289,1,289,7],[289,9,289,11],[289,13,289,15],[289,17,289,23],[289,24,289,26],[289,27,289,28],[289,29,289,31],[290,1,290,7],[290,9,290,11],[290,13,290,15],[290,17,290,23],[290,24,290,26],[290,27,290,28],[290,29,290,31],[287,1,287,7],[287,9,287,11],[287,13,287,15],[287,17,287,23],[287,24,287,26],[287,27,287,28],[287,29,287,31],[288,1,288,7],[288,9,288,11],[288,13,288,15],[288,17,288,23],[288,24,288,26],[288,27,288,28],[288,29,288,31],[293,1,293,7],[293,9,293,11],[293,13,293,15],[293,17,293,23],[293,24,293,26],[293,27,293,28],[293,29,293,31],[294,1,294,7],[294,9,294,11],[294,13,294,15],[294,17,294,23],[294,24,294,26],[294,27,294,28],[294,29,294,31],[291,1,291,7],[291,9,291,11],[291,13,291,15],[291,17,291,23],[291,24,291,26],[291,27,291,28],[291,29,291,31],[292,1,292,7],[292,9,292,11],[292,13,292,15],[292,17,292,23],[292,24,292,26],[292,27,292,28],[292,29,292,31],[297,1,297,7],[297,9,297,11],[297,13,297,15],[297,17,297,23],[297,24,297,26],[297,27,297,28],[297,29,297,31],[298,1,298,7],[298,9,298,11],[298,13,298,15],[298,17,298,23],[298,24,298,26],[298,27,298,28],[298,29,298,31],[295,1,295,7],[295,9,295,11],[295,13,295,15],[295,17,295,23],[295,24,295,26],[295,27,295,28],[295,29,295,31],[296,1,296,7],[296,9,296,11],[296,13,296,15],[296,17,296,23],[296,24,296,26],[296,27,296,28],[296,29,296,31],[301,1,301,7],[301,9,301,11],[301,13,301,15],[301,17,301,23],[301,24,301,26],[301,27,301,28],[301,29,301,31],[302,1,302,7]],"merged_total":1532,"flags":["merged_cut"]}
[]
[null,"SFS Data Entry"]
[]
[]
[null,"Name:",null,null,null,null,null,null,null,{"$f":"IF(Start!$C$9=\"\",\"\",Start!$C$9)","v":""},null,null,null,null,null,null,"Application: ",null,null,null,null,null,null,null,{"$f":"'SFS v2.0'!J7","v":"Single:"},null,null,{"$f":"'SFS v2.0'!M7","v":"Joint:"}]
[null,"D.O.B:",null,null,null,null,null,null,null,{"$f":"IF(Start!$C$11=\"\",\"\",Start!$C$11)","v":""},null,null,null,null,null,null,"Contact/team name:",null,null,null,null,null,null,{"$f":"IF(Start!$I$9=\"\",\"\",Start!$I$9)","v":""}]
[null,"Partner: (if applicable):",null,null,null,null,null,null,null,{"$f":"IF(Start!$C$15=\"\",\"\",Start!$C$15)","v":""},null,null,null,null,null,null,"Agency:",null,null,null,null,null,null,{"$f":"IF(Start!$I$11=\"\",\"\",Start!$I$11)","v":""}]
[null,"Partner D.O.B. (if applicable):",null,null,null,null,null,null,null,{"$f":"IF(Start!$C$17=\"\",\"\",Start!$C$17)","v":""},null,null,null,null,null,null,"Agency address:",null,null,null,null,null,null,{"$f":"IF(Start!$I$13=\"\",\"\",Start!$I$13)","v":""}]
[null,"Address:",null,null,null,null,null,null,null,{"$f":"IF(Start!$C$18=\"\",\"\",Start!$C$18)","v":""},null,null,null,null,null,null,null,null,null,null,null,null,null,{"$f":"IF(Start!$I$14=\"\",\"\",Start!$I$14)","v":""}]
[null,null,null,null,null,null,null,null,null,{"$f":"IF(Start!$C$19=\"\",\"\",Start!$C$19)","v":""},null,null,null,null,null,null,null,null,null,null,null,null,null,{"$f":"IF(Start!$I$15=\"\",\"\",Start!$I$15)","v":""}]
[null,null,null,null,null,null,null,null,null,{"$f":"IF(Start!$C$20=\"\",\"\",Start!$C$20)","v":""},null,null,null,null,null,null,null,null,null,null,null,null,null,{"$f":"IF(Start!$I$16=\"\",\"\",Start!$I$16)","v":""}]
[null,null,null,null,null,null,null,null,null,{"$f":"IF(Start!$C$21=\"\",\"\",Start!$C$21)","v":""},null,null,null,null,null,null,"Membership code number:",null,null,null,null,null,null,{"$f":"IF(Start!$I$18=\"\",\"\",Start!$I$18)","v":12884569}]
[null,"Dependent children: ",null,null,null,null,null,null,null,{"$f":"'SFS v2.0'!J14","v":"Under 16:"},{"$f":"Start!$D$23","v":0},null,null,{"$f":"'SFS v2.0'!N14","v":"16-18:"},{"$f":"Start!$F$23","v":0},null,"Case reference number:",null,null,null,null,null,null,{"$f":"IF(Start!$I$20=\"\",\"\",Start!$I$20)","v":""}]
[null,"Other dependants: ",null,null,null,null,null,null,null,{"$f":"IF(Start!$C$24=\"\",\"\",Start!$C$24)","v":""},null,null,null,null,null,null,"Date of statement:",null,null,null,null,null,null,{"$f":"IF(Start!$I$22=\"\",\"\",Start!$I$22)","v":""}]
[null,null,null,null,null,null,null,null,null,{"$f":"IF(Start!$C$25=\"\",\"\",Start!$C$25)","v":""},null,null,null,null,null,null,"Date of review (if applicable):",null,null,null,null,null,null,{"$f":"IF(Start!$I$24=\"\",\"\",Start!$I$24)","v":""}]
[null,"Number in household:",null,null,null,null,null,null,null,null,null,{"$f":"Start!$C$27","v":0}]
[null,"Number of vehicles in household:",null,null,null,null,null,null,null,null,null,{"$f":"Start!$C$29","v":0},null,null,null,null,"Employment: "]
[null,{"$f":"'SFS v2.0'!$B$19","v":"Housing tenure:"}]
[]
[null,"Please confirm you have considered ",null,null,null,null,null,null,null,null,null,null,null,"Tick to confirm ✔",null,null,"Partner's employment: "]
[null,"(or discussed with an adviser) the use of "]
[null,"any assets to make lump sum payments"]
[]
[]
[]
[null,"Overview",null,null,null,null,null,null,null,null,null,null," Amount (£)",null,null,null,"Notes"]
[null,"Total income",null,null,null,null,null,null,null,null,null,null,{"$f":"Conversions!$H$48","v":0}]
[null,"Total outgoings",null,null,null,null,null,null,null,null,null,null,{"$f":"Conversions!$E$368","v":0}]
[null,"Savings contribution",null,null,null,null,null,null,null,null,null,null,{"$f":"Conversions!$E$369","v":0}]
[null,"Debt admin fee (if applicable):",null,null,null,null,null,null,null,null,null,null,{"$f":"Conversions!$G$370","v":0}]
[null,null,null,null,null,null,null,null,null,null,null,"Total available for priority creditors",{"$f":"$M$27-$M$28-$M$29-$M$30","v":0}]
[null,null,null,null,null,null,null,null,null,null,null,"Total available for non priority creditors",{"$f":"Conversions!$E$385","v":0}]
[]
[]
[null,"Monthly Income"]
[null,{"$f":"Income!B3","v":"Earnings "},null,null,null,null,null,null,null,null,null,null," Amount (£)",null,null,null,{"$f":"Q26","v":"Notes"}]
[null,{"$f":"Income!B4","v":"Salary or wages (take home)"},null,null,null,null,null,null,null,null,null,null,{"$f":"Conversions!H10","v":0},null,null,null,{"$f":"Conversions!S10","v":""}]
[null,{"$f":"Income!B5","v":"Partner salary or wages (take home)"},null,null,null,null,null,null,null,null,null,null,{"$f":"Conversions!H11","v":0},null,null,null,{"$f":"Conversions!S11","v":""}]
[null,{"$f":"Income!B6","v":"Other earnings (including self employment)"},null,null,null,null,null,null,null,null,null,null,{"$f":"Conversions!H12","v":0},null,null,null,{"$f":"Conversions!S12","v":""}]
[null,{"$f":"Income!B7","v":"Total salary and wages per month"},null,null,null,null,null,null,null,null,null,null,{"$f":"Conversions!H14","v":0}]
[]
[null,{"$f":"Income!B9","v":"Benefits and tax credits"},null,null,null,null,null,null,null,null,null,null,null,null,null,null,"Notes"]
[null,{"$f":"Income!B10","v":"Universal Credit"},null,null,null,null,null,null,null,null,null,null,{"$f":"Conversions!H17","v":0},null,null,null,{"$f":"Conversions!S17","v":""}]
[null,{"$f":"Income!B11","v":"Jobseeker’s Allowance (income based)"},null,null,null,null,null,null,null,null,null,null,{"$f":"Conversions!H18","v":0},null,null,null,{"$f":"Conversions!S18","v":""}]
[null,{"$f":"Income!B12","v":"Jobseeker’s Allowance (contribution based)"},null,null,null,null,null,null,null,null,null,null,{"$f":"Conversions!H19","v":0},null,null,null,{"$f":"Conversions!S19","v":""}]
[null,{"$f":"Income!B13","v":"Income Support"},null,null,null,null,null,null,null,null,null,null,{"$f":"Conversions!H20","v":0},null,null,null,{"$f":"Conversions!S20","v":""}]
[null,{"$f":"Income!B14","v":"Working Tax Credit"},null,null,null,null,null,null,null,null,null,null,{"$f":"Conversions!H21","v":0},null,null,null,{"$f":"Conversions!S21","v":""}]
[null,{"$f":"Income!B15","v":"Child Tax Credit"},null,null,null,null,null,null,null,null,null,null,{"$f":"Conversions!H22","v":0},null,null,null,{"$f":"Conversions!S22","v":""}]
[null,{"$f":"Income!B16","v":"Child Benefit"},null,null,null,null,null,null,null,null,null,null,{"$f":"Conversions!H23","v":0},null,null,null,{"$f":"Conversions!S23","v":""}]
[null,{"$f":"Income!B17","v":"Employment and Support Allowance or Statutory Sick Pay"},null,null,null,null,null,null,null,null,null,null,{"$f":"Conversions!H24","v":0},null,null,null,{"$f":"Conversions!S24","v":""}]
[null,{"$f":"Income!B18","v":"Disability benefits"},null,null,null,null,null,null,null,null,null,null,{"$f":"Conversions!H25","v":0},null,null,null,{"$f":"Conversions!S25","v":""}]
[null,{"$f":"Income!B19","v":"Carer’s Allowance"},null,null,null,null,null,null,null,null,null,null,{"$f":"Conversions!H26","v":0},null,null,null,{"$f":"Conversions!S26","v":""}]
[null,{"$f":"Income!B20","v":"Local Housing Allowance / Housing Benefit"},null,null,null,null,null,null,null,null,null,null,{"$f":"Conversions!H27","v":0},null,null,null,{"$f":"Conversions!S27","v":""}]
[null,{"$f":"Income!B21","v":"Council Tax support"},null,null,null,null,null,null,null,null,null,null,{"$f":"Conversions!H28","v":0},null,null,null,{"$f":"Conversions!S28","v":""}]
[null,{"$f":"Income!B22","v":"Other benefits/tax credits (e.g. maternity benefits)"},null,null,null,null,null,null,null,null,null,null,{"$f":"Conversions!H29","v":0},null,null,null,{"$f":"Conversions!S29","v":""}]
[null,{"$f":"Income!B23","v":"Total benefits and tax credits per month"},null,null,null,null,null,null,null,null,null,null,{"$f":"Conversions!H30","v":0},null,null,null,"(continued overleaf)"]
[]
[]
[]
[]
[]
[]
[]
[null,"Monthly Income (continued)"]
[null,{"$f":"Income!B25","v":"Pensions"},null,null,null,null,null,null,null,null,null,null," Amount (£)",null,null,null,"Notes"]
[null,{"$f":"Income!B26","v":"State pensions"},null,null,null,null,null,null,null,null,null,null,{"$f":"Conversions!H33","v":0},null,null,null,{"$f":"Conversions!S33","v":""}]
[null,{"$f":"Income!B27","v":"Private or work pensions"},null,null,null,null,null,null,null,null,null,null,{"$f":"Conversions!H34","v":0},null,null,null,{"$f":"Conversions!S34","v":""}]
[null,{"$f":"Income!B28","v":"Pension credit"},null,null,null,null,null,null,null,null,null,null,{"$f":"Conversions!H35","v":0},null,null,null,{"$f":"Conversions!S35","v":""}]
[null,{"$f":"Income!B29","v":"Other pensions"},null,null,null,null,null,null,null,null,null,null,{"$f":"Conversions!H36","v":0},null,null,null,{"$f":"Conversions!S36","v":""}]
[null,{"$f":"Income!B30","v":"Total pensions per month"},null,null,null,null,null,null,null,null,null,null,{"$f":"Conversions!H37","v":0}]
[]
[null,{"$f":"Income!B32","v":"Other income "},null,null,null,null,null,null,null,null,null,null," Amount (£)",null,null,null,"Notes"]
[null,{"$f":"Income!B33","v":"Maintenance or child support"},null,null,null,null,null,null,null,null,null,null,{"$f":"Conversions!H41","v":0},null,null,null,{"$f":"Conversions!S41","v":""}]
[null,{"$f":"Income!B34","v":"Boarders or lodgers"},null,null,null,null,null,null,null,null,null,null,{"$f":"Conversions!H42","v":0},null,null,null,{"$f":"Conversions!S42","v":""}]
[null,{"$f":"Income!B35","v":"Non-dependants’ contributions"},null,null,null,null,null,null,null,null,null,null,{"$f":"Conversions!H43","v":0},null,null,null,{"$f":"Conversions!S43","v":""}]
[null,{"$f":"Income!B36","v":"Student loans and grants"},null,null,null,null,null,null,null,null,null,null,{"$f":"Conversions!H44","v":0},null,null,null,{"$f":"Conversions!S44","v":""}]
[null,{"$f":"Income!B37","v":"Other income"},null,null,null,null,null,null,null,null,null,null,{"$f":"Conversions!H45","v":0},null,null,null,{"$f":"Conversions!S45","v":""}]
[null,{"$f":"Income!B38","v":"Total other income per month"},null,null,null,null,null,null,null,null,null,null,{"$f":"Conversions!H46","v":0}]
[]
[]
[]
[null,"Monthly Outgoings: Fixed Costs"]
[null,{"$f":"'Outgoings - Fixed'!B3","v":"Home and contents "},null,null,null,null,null,null,null,null,null,null," Amount (£)",null,null,null,"Notes"]
[null,{"$f":"Conversions!C52","v":"Rent"},null,null,null,null,null,null,null,null,null,null,{"$f":"Conversions!H52","v":0},null,null,null,{"$f":"Conversions!S52","v":""}]
[null,{"$f":"Conversions!C53","v":"Ground rent & service charges  \n(factor fees if you live in Scotland)"},null,null,null,null,null,null,null,null,null,null,{"$f":"Conversions!H53","v":0},null,null,null,{"$f":"Conversions!S53","v":""}]
[null,{"$f":"Conversions!C54","v":"Mortgage"},null,null,null,null,null,null,null,null,null,null,{"$f":"Conversions!H54","v":0},null,null,null,{"$f":"Conversions!S54","v":""}]
[null,{"$f":"Conversions!C55","v":"Mortgage endowment"},null,null,null,null,null,null,null,null,null,null,{"$f":"Conversions!H55","v":0},null,null,null,{"$f":"Conversions!S55","v":""}]
[null,{"$f":"Conversions!C56","v":"Secured loans"},null,null,null,null,null,null,null,null,null,null,{"$f":"Conversions!H56","v":0},null,null,null,{"$f":"Conversions!S56","v":""}]
[null,{"$f":"Conversions!C57","v":"Council tax/rates (including water charge if you \nlive in Scotland and rates in NI)"},null,null,null,null,null,null,null,null,null,null,{"$f":"Conversions!H57","v":0},null,null,null,{"$f":"Conversions!S57","v":""}]
[null,{"$f":"Conversions!C58","v":"Appliance & furniture rental (including appliance \nand furniture HP, conditional sale and so on)"},null,null,null,null,null,null,null,null,null,null,{"$f":"Conversions!H58","v":0},null,null,null,{"$f":"Conversions!S58","v":""}]
[null,{"$f":"Conversions!C59","v":"TV licence"},null,null,null,null,null,null,null,null,null,null,{"$f":"Conversions!H59","v":0},null,null,null,{"$f":"Conversions!S59","v":""}]
[null,{"$f":"Conversions!C60","v":"Other costs"},null,null,null,null,null,null,null,null,null,null,{"$f":"Conversions!H60","v":0},null,null,null,{"$f":"Conversions!S60","v":""}]
[null,{"$f":"Conversions!C61","v":"Total home & contents costs per month"},null,null,null,null,null,null,null,null,null,null,{"$f":"Conversions!H61","v":0}]
[]
[null,{"$f":"'Outgoings - Fixed'!B15","v":"Utilities "},null,null,null,null,null,null,null,null,null,null," Amount (£)",null,null,null,"Notes"]
[null,{"$f":"Conversions!C64","v":"Gas"},null,null,null,null,null,null,null,null,null,null,{"$f":"Conversions!H64","v":0},null,null,null,{"$f":"Conversions!S64","v":""}]
[null,{"$f":"Conversions!C65","v":"Electricity"},null,null,null,null,null,null,null,null,null,null,{"$f":"Conversions!H65","v":0},null,null,null,{"$f":"Conversions!S65","v":""}]
[null,{"$f":"Conversions!C66","v":"Other costs (including coal, oil, calor gas etc.)"},null,null,null,null,null,null,null,null,null,null,{"$f":"Conversions!H66","v":0},null,null,null,{"$f":"Conversions!S66","v":""}]
[null,{"$f":"Conversions!C67","v":"Other expenditure"},null,null,null,null,null,null,null,null,null,null,{"$f":"Conversions!H67","v":0},null,null,null,{"$f":"Conversions!S67","v":""}]
[null,{"$f":"Conversions!C69","v":"Total utilities costs per month"},null,null,null,null,null,null,null,null,null,null,{"$f":"Conversions!H69","v":0}]
[]
[null,{"$f":"'Outgoings - Fixed'!B22","v":"Water "},null,null,null,null,null,null,null,null,null,null," Amount (£)",null,null,null,"Notes"]
[null,{"$f":"Conversions!C72","v":"Water supply"},null,null,null,null,null,null,null,null,null,null,{"$f":"Conversions!H72","v":0},null,null,null,{"$f":"Conversions!S72","v":""}]
[null,{"$f":"Conversions!C73","v":"Water waste"},null,null,null,null,null,null,null,null,null,null,{"$f":"Conversions!H73","v":0},null,null,null,{"$f":"Conversions!S73","v":""}]
[null,{"$f":"Conversions!C75","v":"Total water costs per month"},null,null,null,null,null,null,null,null,null,null,{"$f":"Conversions!H75","v":0}]
[]
[]
[]
[]
[null,null,null,null,null,null,null,null,null,null,null,null,null,null,null,null,"(continued overleaf)"]
[]
[]
[]
[null,"Monthly Outgoings: Fixed Costs (continued)"]
[null,{"$f":"'Outgoings - Fixed'!B27","v":"Care and health costs "},null,null,null,null,null,null,null,null,null,null," Amount (£)",null,null,null,"Notes"]
[null,{"$f":"Conversions!C78","v":"Childcare costs"},null,null,null,null,null,null,null,null,null,null,{"$f":"Conversions!H78","v":0},null,null,null,{"$f":"Conversions!S78","v":""}]
[null,{"$f":"Conversions!C79","v":"Adult-care costs"},null,null,null,null,null,null,null,null,null,null,{"$f":"Conversions!H79","v":0},null,null,null,{"$f":"Conversions!S79","v":""}]
[null,{"$f":"Conversions!C80","v":"Child maintenance or child support"},null,null,null,null,null,null,null,null,null,null,{"$f":"Conversions!H80","v":0},null,null,null,{"$f":"Conversions!S80","v":""}]
[null,{"$f":"Conversions!C81","v":"Prescriptions and medicines"},null,null,null,null,null,null,null,null,null,null,{"$f":"Conversions!H81","v":0},null,null,null,{"$f":"Conversions!S81","v":""}]
[null,{"$f":"Conversions!C82","v":"Dentistry and opticians"},null,null,null,null,null,null,null,null,null,null,{"$f":"Conversions!H82","v":0},null,null,null,{"$f":"Conversions!S82","v":""}]
[null,{"$f":"Conversions!C83","v":"Other costs"},null,null,null,null,null,null,null,null,null,null,{"$f":"Conversions!H83","v":0},null,null,null,{"$f":"Conversions!S83","v":""}]
[null,{"$f":"Conversions!C85","v":"Total care and health costs per month"},null,null,null,null,null,null,null,null,null,null,{"$f":"Conversions!H85","v":0}]
[]
[null,{"$f":"'Outgoings - Fixed'!B36","v":"Transport and travel"},null,null,null,null,null,null,null,null,null,null," Amount (£)",null,null,null,"Notes"]
[null,{"$f":"Conversions!C88","v":"Public transport (e.g. work, school, shopping)"},null,null,null,null,null,null,null,null,null,null,{"$f":"Conversions!H88","v":0},null,null,null,{"$f":"Conversions!S88","v":""}]
[null,{"$f":"Conversions!C89","v":"Hire Purchase or conditional sale vehicle"},null,null,null,null,null,null,null,null,null,null,{"$f":"Conversions!H89","v":0},null,null,null,{"$f":"Conversions!S89","v":""}]
[null,{"$f":"Conversions!C90","v":"Car insurance"},null,null,null,null,null,null,null,null,null,null,{"$f":"Conversions!H90","v":0},null,null,null,{"$f":"Conversions!S90","v":""}]
[null,{"$f":"Conversions!C91","v":"Road tax"},null,null,null,null,null,null,null,null,null,null,{"$f":"Conversions!H91","v":0},null,null,null,{"$f":"Conversions!S91","v":""}]
[null,{"$f":"Conversions!C92","v":"MOT and ongoing maintenance"},null,null,null,null,null,null,null,null,null,null,{"$f":"Conversions!H92","v":0},null,null,null,{"$f":"Conversions!S92","v":""}]
[null,{"$f":"Conversions!C93","v":"Breakdown cover"},null,null,null,null,null,null,null,null,null,null,{"$f":"Conversions!H93","v":0},null,null,null,{"$f":"Conversions!S93","v":""}]
[null,{"$f":"Conversions!C94","v":"Fuel, parking and toll road charges"},null,null,null,null,null,null,null,null,null,null,{"$f":"Conversions!H94","v":0},null,null,null,{"$f":"Conversions!S94","v":""}]
[null,{"$f":"Conversions!C95","v":"Other costs (including taxis)"},null,null,null,null,null,null,null,null,null,null,{"$f":"Conversions!H95","v":0},null,null,null,{"$f":"Conversions!S95","v":""}]
[null,{"$f":"Conversions!C97","v":"Total transport and travel costs per month"},null,null,null,null,null,null,null,null,null,null,{"$f":"Conversions!H97","v":0}]
[]
[null,{"$f":"'Outgoings - Fixed'!B47","v":"School costs"},null,null,null,null,null,null,null,null,null,null," Amount (£)",null,null,null,"Notes"]
[null,{"$f":"Conversions!C100","v":"School uniform"},null,null,null,null,null,null,null,null,null,null,{"$f":"Conversions!H100","v":0},null,null,null,{"$f":"Conversions!S100","v":""}]
[null,{"$f":"Conversions!C101","v":"After-school clubs and school trips"},null,null,null,null,null,null,null,null,null,null,{"$f":"Conversions!H101","v":0},null,null,null,{"$f":"Conversions!S101","v":""}]
[null,{"$f":"Conversions!C102","v":"Other costs"},null,null,null,null,null,null,null,null,null,null,{"$f":"Conversions!H102","v":0},null,null,null,{"$f":"Conversions!S102","v":""}]
[null,{"$f":"Conversions!C104","v":"Total school costs per month"},null,null,null,null,null,null,null,null,null,null,{"$f":"Conversions!H104","v":0}]
[]
[null,{"$f":"'Outgoings - Fixed'!B53","v":"Pensions and insurances "},null,null,null,null,null,null,null,null,null,null," Amount (£)",null,null,null,"Notes"]
[null,{"$f":"Conversions!C107","v":"Pension payments"},null,null,null,null,null,null,null,null,null,null,{"$f":"Conversions!H107","v":0},null,null,null,{"$f":"Conversions!S107","v":""}]
[null,{"$f":"Conversions!C108","v":"Life insurance"},null,null,null,null,null,null,null,null,null,null,{"$f":"Conversions!H108","v":0},null,null,null,{"$f":"Conversions!S108","v":""}]
[null,{"$f":"Conversions!C109","v":"Mortgage payment protection insurance"},null,null,null,null,null,null,null,null,null,null,{"$f":"Conversions!H109","v":0},null,null,null,{"$f":"Conversions!S109","v":""}]
[null,{"$f":"Conversions!C110","v":"Buildings and contents insurance"},null,null,null,null,null,null,null,null,null,null,{"$f":"Conversions!H110","v":0},null,null,null,{"$f":"Conversions!S110","v":""}]
[null,{"$f":"Conversions!C111","v":"Health insurance (medical or accident or dental)"},null,null,null,null,null,null,null,null,null,null,{"$f":"Conversions!H111","v":0},null,null,null,{"$f":"Conversions!S111","v":""}]
[null,{"$f":"Conversions!C112","v":"Other costs"},null,null,null,null,null,null,null,null,null,null,{"$f":"Conversions!H112","v":0},null,null,null,{"$f":"Conversions!S112","v":""}]
[null,{"$f":"Conversions!C113","v":"Total pensions and insurance costs per month"},null,null,null,null,null,null,null,null,null,null,{"$f":"Conversions!H113","v":0}]
[]
[null,{"$f":"'Outgoings - Fixed'!B62","v":"Professional costs"},null,null,null,null,null,null,null,null,null,null," Amount (£)",null,null,null,"Notes"]
[null,{"$f":"Conversions!C116","v":"Professional courses"},null,null,null,null,null,null,null,null,null,null,{"$f":"Conversions!H116","v":0},null,null,null,{"$f":"Conversions!S116","v":""}]
[null,{"$f":"Conversions!C117","v":"Union fees"},null,null,null,null,null,null,null,null,null,null,{"$f":"Conversions!H117","v":0},null,null,null,{"$f":"Conversions!S117","v":""}]
[null,{"$f":"Conversions!C118","v":"Professional fees"},null,null,null,null,null,null,null,null,null,null,{"$f":"Conversions!H118","v":0},null,null,null,{"$f":"Conversions!S118","v":""}]
[null,{"$f":"Conversions!C119","v":"Other"},null,null,null,null,null,null,null,null,null,null,{"$f":"Conversions!H119","v":0},null,null,null,{"$f":"Conversions!S119","v":""}]
[null,{"$f":"Conversions!C120","v":"Total professional costs per month"},null,null,null,null,null,null,null,null,null,null,{"$f":"Conversions!H120","v":0}]
[]
[null,{"$f":"'Outgoings - Fixed'!B69","v":"Other essential costs"},null,null,null,null,null,null,null,null,null,null," Amount (£)",null,null,null,"Notes"]
[null,{"$f":"IF(Conversions!C123=\"\",\"\",Conversions!C123)","v":0},null,null,null,null,null,null,null,null,null,null,{"$f":"Conversions!H123","v":0},null,null,null,{"$f":"Conversions!S123","v":""}]
[null,{"$f":"IF(Conversions!C124=\"\",\"\",Conversions!C124)","v":""},null,null,null,null,null,null,null,null,null,null,{"$f":"Conversions!H124","v":0},null,null,null,{"$f":"Conversions!S124","v":""}]
[null,{"$f":"IF(Conversions!C125=\"\",\"\",Conversions!C125)","v":""},null,null,null,null,null,null,null,null,null,null,{"$f":"Conversions!H125","v":0},null,null,null,{"$f":"Conversions!S125","v":""}]
[null,{"$f":"IF(Conversions!C126=\"\",\"\",Conversions!C126)","v":""},null,null,null,null,null,null,null,null,null,null,{"$f":"Conversions!H126","v":0},null,null,null,{"$f":"Conversions!S126","v":""}]
[null,{"$f":"Conversions!C128","v":"Total other essential costs per month"},null,null,null,null,null,null,null,null,null,null,{"$f":"Conversions!H128","v":0}]
[]
[]
[]
[]
[null,"Monthly Outgoings: Flexible Costs"]
[null,{"$f":"'Outgoings - Flexible'!B3","v":"Communications and leisure"},null,null,null,null,null,null,null,null,null,null," Amount (£)",null,null,null,"Notes"]
[null,{"$f":"Conversions!C133","v":"Home phone, internet, TV package  \n(including film subscriptions)"},null,null,null,null,null,null,null,null,null,null,{"$f":"Conversions!H133","v":0},null,null,null,{"$f":"Conversions!S133","v":""}]
[null,{"$f":"Conversions!C134","v":"Mobile phone "},null,null,null,null,null,null,null,null,null,null,{"$f":"Conversions!H134","v":0},null,null,null,{"$f":"Conversions!S134","v":""}]
[null,{"$f":"Conversions!C135","v":"Hobbies, leisure or sport  \n(e.g. socialising, eating out, outings, clubs, leisure courses)"},null,null,null,null,null,null,null,null,null,null,{"$f":"Conversions!H135","v":0},null,null,null,{"$f":"Conversions!S135","v":""}]
[null,{"$f":"Conversions!C136","v":"Gifts (e.g. birthdays, festivals, charity donations)"},null,null,null,null,null,null,null,null,null,null,{"$f":"Conversions!H136","v":0},null,null,null,{"$f":"Conversions!S136","v":""}]
[null,{"$f":"Conversions!C137","v":"Pocket money"},null,null,null,null,null,null,null,null,null,null,{"$f":"Conversions!H137","v":0},null,null,null,{"$f":"Conversions!S137","v":""}]
[null,{"$f":"Conversions!C138","v":"Newspapers, magazines, stationery and postage"},null,null,null,null,null,null,null,null,null,null,{"$f":"Conversions!H138","v":0},null,null,null,{"$f":"Conversions!S138","v":""}]
[null,{"$f":"Conversions!C139","v":"Other costs"},null,null,null,null,null,null,null,null,null,null,{"$f":"Conversions!H139","v":0},null,null,null,{"$f":"Conversions!S139","v":""}]
[null,{"$f":"Conversions!C141","v":"Total communications and leisure costs per month"},null,null,null,null,null,null,null,null,null,null,{"$f":"Conversions!H141","v":0}]
[]
[null,{"$f":"'Outgoings - Flexible'!B13","v":"Food and housekeeping "},null,null,null,null,null,null,null,null,null,null," Amount (£)",null,null,null,"Notes"]
[null,{"$f":"Conversions!C144","v":"Groceries (e.g. food, pet food,  \nnon-alcoholic drinks, cleaning)"},null,null,null,null,null,null,null,null,null,null,{"$f":"Conversions!H144","v":0},null,null,null,{"$f":"Conversions!S144","v":""}]
[null,{"$f":"Conversions!C145","v":"Nappies and baby items"},null,null,null,null,null,null,null,null,null,null,{"$f":"Conversions!H145","v":0},null,null,null,{"$f":"Conversions!S145","v":""}]
[null,{"$f":"Conversions!C146","v":"School meals and meals at work"},null,null,null,null,null,null,null,null,null,null,{"$f":"Conversions!H146","v":0},null,null,null,{"$f":"Conversions!S146","v":""}]
[null,{"$f":"Conversions!C147","v":"Laundry and dry cleaning"},null,null,null,null,null,null,null,null,null,null,{"$f":"Conversions!H147","v":0},null,null,null,{"$f":"Conversions!S147","v":""}]
[null,{"$f":"Conversions!C148","v":"Alcohol"},null,null,null,null,null,null,null,null,null,null,{"$f":"Conversions!H148","v":0},null,null,null,{"$f":"Conversions!S148","v":""}]
[null,{"$f":"Conversions!C149","v":"Smoking products"},null,null,null,null,null,null,null,null,null,null,{"$f":"Conversions!H149","v":0},null,null,null,{"$f":"Conversions!S149","v":""}]
[null,{"$f":"Conversions!C150","v":"Vet bills & pet insurance"},null,null,null,null,null,null,null,null,null,null,{"$f":"Conversions!H150","v":0},null,null,null,{"$f":"Conversions!S150","v":""}]
[null,{"$f":"Conversions!C151","v":"House repairs and maintenance"},null,null,null,null,null,null,null,null,null,null,{"$f":"Conversions!H151","v":0},null,null,null,{"$f":"Conversions!S151","v":""}]
[null,{"$f":"Conversions!C152","v":"Other costs"},null,null,null,null,null,null,null,null,null,null,{"$f":"Conversions!H152","v":0},null,null,null,{"$f":"Conversions!S152","v":""}]
[null,{"$f":"Conversions!C154","v":"Total food and housekeeping costs per month"},null,null,null,null,null,null,null,null,null,null,{"$f":"Conversions!H154","v":0}]
[]
[null,{"$f":"'Outgoings - Flexible'!B25","v":"Personal costs "},null,null,null,null,null,null,null,null,null,null," Amount (£)",null,null,null,"Notes"]
[null,{"$f":"Conversions!C157","v":"Clothing and footwear"},null,null,null,null,null,null,null,null,null,null,{"$f":"Conversions!H157","v":0},null,null,null,{"$f":"Conversions!S157","v":""}]
[null,{"$f":"Conversions!C158","v":"Hairdressing"},null,null,null,null,null,null,null,null,null,null,{"$f":"Conversions!H158","v":0},null,null,null,{"$f":"Conversions!S158","v":""}]
[null,{"$f":"Conversions!C159","v":"Toiletries"},null,null,null,null,null,null,null,null,null,null,{"$f":"Conversions!H159","v":0},null,null,null,{"$f":"Conversions!S159","v":""}]
[null,{"$f":"Conversions!C160","v":"Other costs"},null,null,null,null,null,null,null,null,null,null,{"$f":"Conversions!H160","v":0},null,null,null,{"$f":"Conversions!S160","v":""}]
[null,{"$f":"Conversions!C162","v":"Total personal costs per month"},null,null,null,null,null,null,null,null,null,null,{"$f":"Conversions!H162","v":0}]
[]
[null,"Total Monthly Outgoings: (fixed and flexible)"]
[null,null,null,null,null,null,null,null,null,null,null,null," Amount (£)"]
[null,"Total costs per month",null,null,null,null,null,null,null,null,null,null,{"$f":"Conversions!H164","v":0}]
[]
[]
[null,"Savings"]
[null,null,null,null,null,null,null,null,null,null,null,null,"Amount (£)"]
[null,null,null,null,null,null,null,null,null,null,null,null,{"$f":"Savings!D8","v":0}]
[]
[null,"Please confirm that a monthly contribution to savings has been considered  \n(or discussed with an adviser)",null,null,null,null,null,null,null,null,null,null,null,null,null,null,null,null,null,null,null,null,null,null,null,"Tick to confirmü"]
[]
[]
[null,"Debt Admin Fee (if applicable)"]
[null,"Total fee per month",null,null,null,null,null,null,null,null,null,null,"Amount (£)",null,null,null,null,null,"Notes"]
[null,{"$f":"IF('Debt Admin Fee'!C8=\"\",\"\",'Debt Admin Fee'!C8)","v":""},null,null,null,null,null,null,null,null,null,null,{"$f":"'Debt Admin Fee'!E8","v":0},null,null,null,null,null,{"$f":"IF('Debt Admin Fee'!K8=\"\",\"\",'Debt Admin Fee'!K8)","v":""}]
[]
[]
[null,"Debts"]
[]
[null,"Priority Debts",null,null,null,null,null,null,null,null,null,null,null,null,null,null,null,"Non - Priority Debts"]
[]
[null,"Creditor",null,null,null,null,null,null,null,"Owed (£) ",null,null,null,"Offer",null,null,null,"Creditor",null,null,null,null,null,null,"Owed (£) ",null,null,"CCJ",null,"Offer"]
[null,{"$f":"IF(Debts!B6=\"\",\"\",Debts!B6)","v":""},null,null,null,null,null,null,null,{"$f":"IF(Debts!D6<>0,Debts!D6,\"\")","v":""},null,null,null,{"$f":"'SFS v2.0'!N79","v":""},null,null,null,{"$f":"IF(Debts!B110=\"\",\"\",Debts!B110)","v":""},null,null,null,null,null,null,{"$f":"IF(Conversions!C268<>0,Conversions!E268,\"\")","v":""},null,null,{"$f":"IF(Conversions!J268=TRUE,\"Y\",\"N\")","v":"N"},null,{"$f":"IF(Conversions!C268<>0,Conversions!O268,\"\")","v":""}]
[null,{"$f":"IF(Debts!B7=\"\",\"\",Debts!B7)","v":""},null,null,null,null,null,null,null,{"$f":"IF(Debts!D7<>0,Debts!D7,\"\")","v":""},null,null,null,{"$f":"'SFS v2.0'!N80","v":""},null,null,null,{"$f":"IF(Debts!B111=\"\",\"\",Debts!B111)","v":""},null,null,null,null,null,null,{"$f":"IF(Conversions!C269<>0,Conversions!E269,\"\")","v":""},null,null,{"$f":"IF(Conversions!J269=TRUE,\"Y\",\"N\")","v":"N"},null,{"$f":"IF(Conversions!C269<>0,Conversions!O269,\"\")","v":""}]
[null,{"$f":"IF(Debts!B8=\"\",\"\",Debts!B8)","v":""},null,null,null,null,null,null,null,{"$f":"IF(Debts!D8<>0,Debts!D8,\"\")","v":""},null,null,null,{"$f":"'SFS v2.0'!N81","v":""},null,null,null,{"$f":"IF(Debts!B112=\"\",\"\",Debts!B112)","v":""},null,null,null,null,null,null,{"$f":"IF(Conversions!C270<>0,Conversions!E270,\"\")","v":""},null,null,{"$f":"IF(Conversions!J270=TRUE,\"Y\",\"N\")","v":"N"},null,{"$f":"IF(Conversions!C270<>0,Conversions!O270,\"\")","v":""}]
[null,{"$f":"IF(Debts!B9=\"\",\"\",Debts!B9)","v":""},null,null,null,null,null,null,null,{"$f":"IF(Debts!D9<>0,Debts!D9,\"\")","v":""},null,null,null,{"$f":"'SFS v2.0'!N82","v":""},null,null,null,{"$f":"IF(Debts!B113=\"\",\"\",Debts!B113)","v":""},null,null,null,null,null,null,{"$f":"IF(Conversions!C271<>0,Conversions!E271,\"\")","v":""},null,null,{"$f":"IF(Conversions!J271=TRUE,\"Y\",\"N\")","v":"N"},null,{"$f":"IF(Conversions!C271<>0,Conversions!O271,\"\")","v":""}]
[null,{"$f":"IF(Debts!B10=\"\",\"\",Debts!B10)","v":""},null,null,null,null,null,null,null,{"$f":"IF(Debts!D10<>0,Debts!D10,\"\")","v":""},null,null,null,{"$f":"'SFS v2.0'!N83","v":""},null,null,null,{"$f":"IF(Debts!B114=\"\",\"\",Debts!B114)","v":""},null,null,null,null,null,null,{"$f":"IF(Conversions!C272<>0,Conversions!E272,\"\")","v":""},null,null,{"$f":"IF(Conversions!J272=TRUE,\"Y\",\"N\")","v":"N"},null,{"$f":"IF(Conversions!C272<>0,Conversions!O272,\"\")","v":""}]
[null,{"$f":"IF(Debts!B11=\"\",\"\",Debts!B11)","v":""},null,null,null,null,null,null,null,{"$f":"IF(Debts!D11<>0,Debts!D11,\"\")","v":""},null,null,null,{"$f":"'SFS v2.0'!N84","v":""},null,null,null,{"$f":"IF(Debts!B115=\"\",\"\",Debts!B115)","v":""},null,null,null,null,null,null,{"$f":"IF(Conversions!C273<>0,Conversions!E273,\"\")","v":""},null,null,{"$f":"IF(Conversions!J273=TRUE,\"Y\",\"N\")","v":"N"},null,{"$f":"IF(Conversions!C273<>0,Conversions!O273,\"\")","v":""}]
[null,{"$f":"IF(Debts!B12=\"\",\"\",Debts!B12)","v":""},null,null,null,null,null,null,null,{"$f":"IF(Debts!D12<>0,Debts!D12,\"\")","v":""},null,null,null,{"$f":"'SFS v2.0'!N85","v":""},null,null,null,{"$f":"IF(Debts!B116=\"\",\"\",Debts!B116)","v":""},null,null,null,null,null,null,{"$f":"IF(Conversions!C274<>0,Conversions!E274,\"\")","v":""},null,null,{"$f":"IF(Conversions!J274=TRUE,\"Y\",\"N\")","v":"N"},null,{"$f":"IF(Conversions!C274<>0,Conversions!O274,\"\")","v":""}]
[null,{"$f":"IF(Debts!B13=\"\",\"\",Debts!B13)","v":""},null,null,null,null,null,null,null,{"$f":"IF(Debts!D13<>0,Debts!D13,\"\")","v":""},null,null,null,{"$f":"'SFS v2.0'!N86","v":""},null,null,null,{"$f":"IF(Debts!B117=\"\",\"\",Debts!B117)","v":""},null,null,null,null,null,null,{"$f":"IF(Conversions!C275<>0,Conversions!E275,\"\")","v":""},null,null,{"$f":"IF(Conversions!J275=TRUE,\"Y\",\"N\")","v":"N"},null,{"$f":"IF(Conversions!C275<>0,Conversions!O275,\"\")","v":""}]
[null,{"$f":"IF(Debts!B14=\"\",\"\",Debts!B14)","v":""},null,null,null,null,null,null,null,{"$f":"IF(Debts!D14<>0,Debts!D14,\"\")","v":""},null,null,null,{"$f":"'SFS v2.0'!N87","v":""},null,null,null,{"$f":"IF(Debts!B118=\"\",\"\",Debts!B118)","v":""},null,null,null,null,null,null,{"$f":"IF(Conversions!C276<>0,Conversions!E276,\"\")","v":""},null,null,{"$f":"IF(Conversions!J276=TRUE,\"Y\",\"N\")","v":"N"},null,{"$f":"IF(Conversions!C276<>0,Conversions!O276,\"\")","v":""}]
[null,{"$f":"IF(Debts!B15=\"\",\"\",Debts!B15)","v":""},null,null,null,null,null,null,null,{"$f":"IF(Debts!D15<>0,Debts!D15,\"\")","v":""},null,null,null,{"$f":"'SFS v2.0'!N88","v":""},null,null,null,{"$f":"IF(Debts!B119=\"\",\"\",Debts!B119)","v":""},null,null,null,null,null,null,{"$f":"IF(Conversions!C277<>0,Conversions!E277,\"\")","v":""},null,null,{"$f":"IF(Conversions!J277=TRUE,\"Y\",\"N\")","v":"N"},null,{"$f":"IF(Conversions!C277<>0,Conversions!O277,\"\")","v":""}]
[null,{"$f":"IF(Debts!B16=\"\",\"\",Debts!B16)","v":""},null,null,null,null,null,null,null,{"$f":"IF(Debts!D16<>0,Debts!D16,\"\")","v":""},null,null,null,{"$f":"'SFS v2.0'!N89","v":""},null,null,null,{"$f":"IF(Debts!B120=\"\",\"\",Debts!B120)","v":""},null,null,null,null,null,null,{"$f":"IF(Conversions!C278<>0,Conversions!E278,\"\")","v":""},null,null,{"$f":"IF(Conversions!J278=TRUE,\"Y\",\"N\")","v":"N"},null,{"$f":"IF(Conversions!C278<>0,Conversions!O278,\"\")","v":""}]
[null,{"$f":"IF(Debts!B17=\"\",\"\",Debts!B17)","v":""},null,null,null,null,null,null,null,{"$f":"IF(Debts!D17<>0,Debts!D17,\"\")","v":""},null,null,null,{"$f":"'SFS v2.0'!N90","v":""},null,null,null,{"$f":"IF(Debts!B121=\"\",\"\",Debts!B121)","v":""},null,null,null,null,null,null,{"$f":"IF(Conversions!C279<>0,Conversions!E279,\"\")","v":""},null,null,{"$f":"IF(Conversions!J279=TRUE,\"Y\",\"N\")","v":"N"},null,{"$f":"IF(Conversions!C279<>0,Conversions!O279,\"\")","v":""}]
[null,{"$f":"IF(Debts!B18=\"\",\"\",Debts!B18)","v":""},null,null,null,null,null,null,null,{"$f":"IF(Debts!D18<>0,Debts!D18,\"\")","v":""},null,null,null,{"$f":"'SFS v2.0'!N91","v":""},null,null,null,{"$f":"IF(Debts!B122=\"\",\"\",Debts!B122)","v":""},null,null,null,null,null,null,{"$f":"IF(Conversions!C280<>0,Conversions!E280,\"\")","v":""},null,null,{"$f":"IF(Conversions!J280=TRUE,\"Y\",\"N\")","v":"N"},null,{"$f":"IF(Conversions!C280<>0,Conversions!O280,\"\")","v":""}]
[null,{"$f":"IF(Debts!B19=\"\",\"\",Debts!B19)","v":""},null,null,null,null,null,null,null,{"$f":"IF(Debts!D19<>0,Debts!D19,\"\")","v":""},null,null,null,{"$f":"'SFS v2.0'!N92","v":""},null,null,null,{"$f":"IF(Debts!B123=\"\",\"\",Debts!B123)","v":""},null,null,null,null,null,null,{"$f":"IF(Conversions!C281<>0,Conversions!E281,\"\")","v":""},null,null,{"$f":"IF(Conversions!J281=TRUE,\"Y\",\"N\")","v":"N"},null,{"$f":"IF(Conversions!C281<>0,Conversions!O281,\"\")","v":""}]
[null,{"$f":"IF(Debts!B20=\"\",\"\",Debts!B20)","v":""},null,null,null,null,null,null,null,{"$f":"IF(Debts!D20<>0,Debts!D20,\"\")","v":""},null,null,null,{"$f":"'SFS v2.0'!N93","v":""},null,null,null,{"$f":"IF(Debts!B124=\"\",\"\",Debts!B124)","v":""},null,null,null,null,null,null,{"$f":"IF(Conversions!C282<>0,Conversions!E282,\"\")","v":""},null,null,{"$f":"IF(Conversions!J282=TRUE,\"Y\",\"N\")","v":"N"},null,{"$f":"IF(Conversions!C282<>0,Conversions!O282,\"\")","v":""}]
[null,{"$f":"IF(Debts!B21=\"\",\"\",Debts!B21)","v":""},null,null,null,null,null,null,null,{"$f":"IF(Debts!D21<>0,Debts!D21,\"\")","v":""},null,null,null,{"$f":"'SFS v2.0'!N94","v":""},null,null,null,{"$f":"IF(Debts!B125=\"\",\"\",Debts!B125)","v":""},null,null,null,null,null,null,{"$f":"IF(Conversions!C283<>0,Conversions!E283,\"\")","v":""},null,null,{"$f":"IF(Conversions!J283=TRUE,\"Y\",\"N\")","v":"N"},null,{"$f":"IF(Conversions!C283<>0,Conversions!O283,\"\")","v":""}]
[null,{"$f":"IF(Debts!B22=\"\",\"\",Debts!B22)","v":""},null,null,null,null,null,null,null,{"$f":"IF(Debts!D22<>0,Debts!D22,\"\")","v":""},null,null,null,{"$f":"'SFS v2.0'!N95","v":""},null,null,null,{"$f":"IF(Debts!B126=\"\",\"\",Debts!B126)","v":""},null,null,null,null,null,null,{"$f":"IF(Conversions!C284<>0,Conversions!E284,\"\")","v":""},null,null,{"$f":"IF(Conversions!J284=TRUE,\"Y\",\"N\")","v":"N"},null,{"$f":"IF(Conversions!C284<>0,Conversions!O284,\"\")","v":""}]
[null,{"$f":"IF(Debts!B23=\"\",\"\",Debts!B23)","v":""},null,null,null,null,null,null,null,{"$f":"IF(Debts!D23<>0,Debts!D23,\"\")","v":""},null,null,null,{"$f":"'SFS v2.0'!N96","v":""},null,null,null,{"$f":"IF(Debts!B127=\"\",\"\",Debts!B127)","v":""},null,null,null,null,null,null,{"$f":"IF(Conversions!C285<>0,Conversions!E285,\"\")","v":""},null,null,{"$f":"IF(Conversions!J285=TRUE,\"Y\",\"N\")","v":"N"},null,{"$f":"IF(Conversions!C285<>0,Conversions!O285,\"\")","v":""}]
[null,{"$f":"IF(Debts!B24=\"\",\"\",Debts!B24)","v":""},null,null,null,null,null,null,null,{"$f":"IF(Debts!D24<>0,Debts!D24,\"\")","v":""},null,null,null,{"$f":"'SFS v2.0'!N97","v":""},null,null,null,{"$f":"IF(Debts!B128=\"\",\"\",Debts!B128)","v":""},null,null,null,null,null,null,{"$f":"IF(Conversions!C286<>0,Conversions!E286,\"\")","v":""},null,null,{"$f":"IF(Conversions!J286=TRUE,\"Y\",\"N\")","v":"N"},null,{"$f":"IF(Conversions!C286<>0,Conversions!O286,\"\")","v":""}]
[null,{"$f":"IF(Debts!B25=\"\",\"\",Debts!B25)","v":""},null,null,null,null,null,null,null,{"$f":"IF(Debts!D25<>0,Debts!D25,\"\")","v":""},null,null,null,{"$f":"'SFS v2.0'!N98","v":""},null,null,null,{"$f":"IF(Debts!B129=\"\",\"\",Debts!B129)","v":""},null,null,null,null,null,null,{"$f":"IF(Conversions!C287<>0,Conversions!E287,\"\")","v":""},null,null,{"$f":"IF(Conversions!J287=TRUE,\"Y\",\"N\")","v":"N"},null,{"$f":"IF(Conversions!C287<>0,Conversions!O287,\"\")","v":""}]
[null,{"$f":"IF(Debts!B26=\"\",\"\",Debts!B26)","v":""},null,null,null,null,null,null,null,{"$f":"IF(Debts!D26<>0,Debts!D26,\"\")","v":""},null,null,null,{"$f":"'SFS v2.0'!N99","v":""},null,null,null,{"$f":"IF(Debts!B130=\"\",\"\",Debts!B130)","v":""},null,null,null,null,null,null,{"$f":"IF(Conversions!C288<>0,Conversions!E288,\"\")","v":""},null,null,{"$f":"IF(Conversions!J288=TRUE,\"Y\",\"N\")","v":"N"},null,{"$f":"IF(Conversions!C288<>0,Conversions!O288,\"\")","v":""}]
[null,{"$f":"IF(Debts!B27=\"\",\"\",Debts!B27)","v":""},null,null,null,null,null,null,null,{"$f":"IF(Debts!D27<>0,Debts!D27,\"\")","v":""},null,null,null,{"$f":"'SFS v2.0'!N100","v":""},null,null,null,{"$f":"IF(Debts!B131=\"\",\"\",Debts!B131)","v":""},null,null,null,null,null,null,{"$f":"IF(Conversions!C289<>0,Conversions!E289,\"\")","v":""},null,null,{"$f":"IF(Conversions!J289=TRUE,\"Y\",\"N\")","v":"N"},null,{"$f":"IF(Conversions!C289<>0,Conversions!O289,\"\")","v":""}]
[null,{"$f":"IF(Debts!B28=\"\",\"\",Debts!B28)","v":""},null,null,null,null,null,null,null,{"$f":"IF(Debts!D28<>0,Debts!D28,\"\")","v":""},null,null,null,{"$f":"'SFS v2.0'!N101","v":""},null,null,null,{"$f":"IF(Debts!B132=\"\",\"\",Debts!B132)","v":""},null,null,null,null,null,null,{"$f":"IF(Conversions!C290<>0,Conversions!E290,\"\")","v":""},null,null,{"$f":"IF(Conversions!J290=TRUE,\"Y\",\"N\")","v":"N"},null,{"$f":"IF(Conversions!C290<>0,Conversions!O290,\"\")","v":""}]
[null,{"$f":"IF(Debts!B29=\"\",\"\",Debts!B29)","v":""},null,null,null,null,null,null,null,{"$f":"IF(Debts!D29<>0,Debts!D29,\"\")","v":""},null,null,null,{"$f":"'SFS v2.0'!N102","v":""},null,null,null,{"$f":"IF(Debts!B133=\"\",\"\",Debts!B133)","v":""},null,null,null,null,null,null,{"$f":"IF(Conversions!C291<>0,Conversions!E291,\"\")","v":""},null,null,{"$f":"IF(Conversions!J291=TRUE,\"Y\",\"N\")","v":"N"},null,{"$f":"IF(Conversions!C291<>0,Conversions!O291,\"\")","v":""}]
[null,{"$f":"IF(Debts!B30=\"\",\"\",Debts!B30)","v":""},null,null,null,null,null,null,null,{"$f":"IF(Debts!D30<>0,Debts!D30,\"\")","v":""},null,null,null,{"$f":"'SFS v2.0'!N103","v":""},null,null,null,{"$f":"IF(Debts!B134=\"\",\"\",Debts!B134)","v":""},null,null,null,null,null,null,{"$f":"IF(Conversions!C292<>0,Conversions!E292,\"\")","v":""},null,null,{"$f":"IF(Conversions!J292=TRUE,\"Y\",\"N\")","v":"N"},null,{"$f":"IF(Conversions!C292<>0,Conversions!O292,\"\")","v":""}]
[null,{"$f":"IF(Debts!B31=\"\",\"\",Debts!B31)","v":""},null,null,null,null,null,null,null,{"$f":"IF(Debts!D31<>0,Debts!D31,\"\")","v":""},null,null,null,{"$f":"'SFS v2.0'!N104","v":""},null,null,null,{"$f":"IF(Debts!B135=\"\",\"\",Debts!B135)","v":""},null,null,null,null,null,null,{"$f":"IF(Conversions!C293<>0,Conversions!E293,\"\")","v":""},null,null,{"$f":"IF(Conversions!J293=TRUE,\"Y\",\"N\")","v":"N"},null,{"$f":"IF(Conversions!C293<>0,Conversions!O293,\"\")","v":""}]
[null,{"$f":"IF(Debts!B32=\"\",\"\",Debts!B32)","v":""},null,null,null,null,null,null,null,null,null,null,null,{"$f":"'SFS v2.0'!N105","v":""},null,null,null,{"$f":"IF(Debts!B136=\"\",\"\",Debts!B136)","v":""},null,null,null,null,null,null,{"$f":"IF(Conversions!C294<>0,Conversions!E294,\"\")","v":""},null,null,{"$f":"IF(Conversions!J294=TRUE,\"Y\",\"N\")","v":"N"},null,{"$f":"IF(Conversions!C294<>0,Conversions!O294,\"\")","v":""}]
[null,{"$f":"IF(Debts!B33=\"\",\"\",Debts!B33)","v":""},null,null,null,null,null,null,null,null,null,null,null,null,null,null,null,{"$f":"IF(Debts!B137=\"\",\"\",Debts!B137)","v":""},null,null,null,null,null,null,{"$f":"IF(Conversions!C295<>0,Conversions!E295,\"\")","v":""},null,null,{"$f":"IF(Conversions!J295=TRUE,\"Y\",\"N\")","v":"N"},null,{"$f":"IF(Conversions!C295<>0,Conversions!O295,\"\")","v":""}]
[null,{"$f":"IF(Debts!B34=\"\",\"\",Debts!B34)","v":""},null,null,null,null,null,null,null,null,null,null,null,null,null,null,null,{"$f":"IF(Debts!B138=\"\",\"\",Debts!B138)","v":""},null,null,null,null,null,null,{"$f":"IF(Conversions!C296<>0,Conversions!E296,\"\")","v":""},null,null,{"$f":"IF(Conversions!J296=TRUE,\"Y\",\"N\")","v":"N"},null,{"$f":"IF(Conversions!C296<>0,Conversions!O296,\"\")","v":""}]
[null,{"$f":"IF(Debts!B35=\"\",\"\",Debts!B35)","v":""},null,null,null,null,null,null,null,null,null,null,null,null,null,null,null,{"$f":"IF(Debts!B139=\"\",\"\",Debts!B139)","v":""},null,null,null,null,null,null,{"$f":"IF(Conversions!C297<>0,Conversions!E297,\"\")","v":""},null,null,{"$f":"IF(Conversions!J297=TRUE,\"Y\",\"N\")","v":"N"},null,{"$f":"IF(Conversions!C297<>0,Conversions!O297,\"\")","v":""}]
[null,{"$f":"IF(Debts!B36=\"\",\"\",Debts!B36)","v":""},null,null,null,null,null,null,null,null,null,null,null,null,null,null,null,{"$f":"IF(Debts!B140=\"\",\"\",Debts!B140)","v":""},null,null,null,null,null,null,{"$f":"IF(Conversions!C298<>0,Conversions!E298,\"\")","v":""},null,null,{"$f":"IF(Conversions!J298=TRUE,\"Y\",\"N\")","v":"N"},null,{"$f":"IF(Conversions!C298<>0,Conversions!O298,\"\")","v":""}]
[null,{"$f":"IF(Debts!B37=\"\",\"\",Debts!B37)","v":""},null,null,null,null,null,null,null,null,null,null,null,null,null,null,null,{"$f":"IF(Debts!B141=\"\",\"\",Debts!B141)","v":""},null,null,null,null,null,null,{"$f":"IF(Conversions!C299<>0,Conversions!E299,\"\")","v":""},null,null,{"$f":"IF(Conversions!J299=TRUE,\"Y\",\"N\")","v":"N"},null,{"$f":"IF(Conversions!C299<>0,Conversions!O299,\"\")","v":""}]
[null,{"$f":"IF(Debts!B38=\"\",\"\",Debts!B38)","v":""},null,null,null,null,null,null,null,null,null,null,null,null,null,null,null,{"$f":"IF(Debts!B142=\"\",\"\",Debts!B142)","v":""},null,null,null,null,null,null,{"$f":"IF(Conversions!C300<>0,Conversions!E300,\"\")","v":""},null,null,{"$f":"IF(Conversions!J300=TRUE,\"Y\",\"N\")","v":"N"},null,{"$f":"IF(Conversions!C300<>0,Conversions!O300,\"\")","v":""}]
[null,{"$f":"IF(Debts!B39=\"\",\"\",Debts!B39)","v":""},null,null,null,null,null,null,null,null,null,null,null,null,null,null,null,{"$f":"IF(Debts!B143=\"\",\"\",Debts!B143)","v":""},null,null,null,null,null,null,{"$f":"IF(Conversions!C301<>0,Conversions!E301,\"\")","v":""},null,null,{"$f":"IF(Conversions!J301=TRUE,\"Y\",\"N\")","v":"N"},null,{"$f":"IF(Conversions!C301<>0,Conversions!O301,\"\")","v":""}]
[null,{"$f":"IF(Debts!B40=\"\",\"\",Debts!B40)","v":""},null,null,null,null,null,null,null,null,null,null,null,null,null,null,null,{"$f":"IF(Debts!B144=\"\",\"\",Debts!B144)","v":""},null,null,null,null,null,null,{"$f":"IF(Conversions!C302<>0,Conversions!E302,\"\")","v":""},null,null,{"$f":"IF(Conversions!J302=TRUE,\"Y\",\"N\")","v":"N"},null,{"$f":"IF(Conversions!C302<>0,Conversions!O302,\"\")","v":""}]
[null,{"$f":"IF(Debts!B41=\"\",\"\",Debts!B41)","v":""},null,null,null,null,null,null,null,null,null,null,null,null,null,null,null,{"$f":"IF(Debts!B145=\"\",\"\",Debts!B145)","v":""},null,null,null,null,null,null,{"$f":"IF(Conversions!C303<>0,Conversions!E303,\"\")","v":""},null,null,{"$f":"IF(Conversions!J303=TRUE,\"Y\",\"N\")","v":"N"},null,{"$f":"IF(Conversions!C303<>0,Conversions!O303,\"\")","v":""}]
[null,{"$f":"IF(Debts!B42=\"\",\"\",Debts!B42)","v":""},null,null,null,null,null,null,null,null,null,null,null,null,null,null,null,{"$f":"IF(Debts!B146=\"\",\"\",Debts!B146)","v":""},null,null,null,null,null,null,{"$f":"IF(Conversions!C304<>0,Conversions!E304,\"\")","v":""},null,null,{"$f":"IF(Conversions!J304=TRUE,\"Y\",\"N\")","v":"N"},null,{"$f":"IF(Conversions!C304<>0,Conversions!O304,\"\")","v":""}]
[null,{"$f":"IF(Debts!B43=\"\",\"\",Debts!B43)","v":""},null,null,null,null,null,null,null,null,null,null,null,null,null,null,null,{"$f":"IF(Debts!B147=\"\",\"\",Debts!B147)","v":""},null,null,null,null,null,null,null,null,null,{"$f":"IF(Conversions!J360=TRUE,\"Y\",\"N\")","v":"N"}]
[null,{"$f":"IF(Debts!B44=\"\",\"\",Debts!B44)","v":""},null,null,null,null,null,null,null,null,null,null,null,null,null,null,null,{"$f":"IF(Debts!B148=\"\",\"\",Debts!B148)","v":""},null,null,null,null,null,null,null,null,null,{"$f":"IF(Conversions!J361=TRUE,\"Y\",\"N\")","v":"N"}]
[null,{"$f":"IF(Debts!B45=\"\",\"\",Debts!B45)","v":""},null,null,null,null,null,null,null,null,null,null,null,null,null,null,null,{"$f":"IF(Debts!B149=\"\",\"\",Debts!B149)","v":""},null,null,null,null,null,null,null,null,null,{"$f":"IF(Conversions!J364=TRUE,\"Y\",\"N\")","v":"N"}]
[null,{"$f":"IF(Debts!B46=\"\",\"\",Debts!B46)","v":""},null,null,null,null,null,null,null,null,null,null,null,null,null,null,null,{"$f":"IF(Debts!B150=\"\",\"\",Debts!B150)","v":""},null,null,null,null,null,null,null,null,null,{"$f":"IF(Conversions!J365=TRUE,\"Y\",\"N\")","v":"N"}]
[null,{"$f":"IF(Debts!B47=\"\",\"\",Debts!B47)","v":""},null,null,null,null,null,null,null,null,null,null,null,null,null,null,null,{"$f":"IF(Debts!B151=\"\",\"\",Debts!B151)","v":""},null,null,null,null,null,null,null,null,null,{"$f":"IF(Conversions!J366=TRUE,\"Y\",\"N\")","v":"N"}]
[null,{"$f":"IF(Debts!B48=\"\",\"\",Debts!B48)","v":""},null,null,null,null,null,null,null,null,null,null,null,null,null,null,null,{"$f":"IF(Debts!B152=\"\",\"\",Debts!B152)","v":""},null,null,null,null,null,null,null,null,null,{"$f":"IF(Conversions!J367=TRUE,\"Y\",\"N\")","v":"N"}]
[null,{"$f":"IF(Debts!B49=\"\",\"\",Debts!B49)","v":""},null,null,null,null,null,null,null,null,null,null,null,null,null,null,null,{"$f":"IF(Debts!B153=\"\",\"\",Debts!B153)","v":""},null,null,null,null,null,null,null,null,null,{"$f":"IF(Conversions!J368=TRUE,\"Y\",\"N\")","v":"N"}]
[null,{"$f":"IF(Debts!B50=\"\",\"\",Debts!B50)","v":""},null,null,null,null,null,null,null,null,null,null,null,null,null,null,null,{"$f":"IF(Debts!B154=\"\",\"\",Debts!B154)","v":""},null,null,null,null,null,null,null,null,null,{"$f":"IF(Conversions!J371=TRUE,\"Y\",\"N\")","v":"N"}]
[null,{"$f":"IF(Debts!B51=\"\",\"\",Debts!B51)","v":""},null,null,null,null,null,null,null,null,null,null,null,null,null,null,null,{"$f":"IF(Debts!B155=\"\",\"\",Debts!B155)","v":""},null,null,null,null,null,null,null,null,null,{"$f":"IF(Conversions!J369=TRUE,\"Y\",\"N\")","v":"N"}]
[null,{"$f":"IF(Debts!B52=\"\",\"\",Debts!B52)","v":""},null,null,null,null,null,null,null,null,null,null,null,null,null,null,null,{"$f":"IF(Debts!B156=\"\",\"\",Debts!B156)","v":""},null,null,null,null,null,null,null,null,null,{"$f":"IF(Conversions!J372=TRUE,\"Y\",\"N\")","v":"N"}]
[null,{"$f":"IF(Debts!B53=\"\",\"\",Debts!B53)","v":""},null,null,null,null,null,null,null,null,null,null,null,null,null,null,null,{"$f":"IF(Debts!B157=\"\",\"\",Debts!B157)","v":""},null,null,null,null,null,null,null,null,null,{"$f":"IF(Conversions!J373=TRUE,\"Y\",\"N\")","v":"N"}]
[null,{"$f":"IF(Debts!B54=\"\",\"\",Debts!B54)","v":""},null,null,null,null,null,null,null,null,null,null,null,null,null,null,null,{"$f":"IF(Debts!B158=\"\",\"\",Debts!B158)","v":""},null,null,null,null,null,null,null,null,null,{"$f":"IF(Conversions!J374=TRUE,\"Y\",\"N\")","v":"N"}]
[null,{"$f":"IF(Debts!B55=\"\",\"\",Debts!B55)","v":""},null,null,null,null,null,null,null,null,null,null,null,null,null,null,null,{"$f":"IF(Debts!B159=\"\",\"\",Debts!B159)","v":""},null,null,null,null,null,null,null,null,null,{"$f":"IF(Conversions!J375=TRUE,\"Y\",\"N\")","v":"N"}]
[null,{"$f":"IF(Debts!B56=\"\",\"\",Debts!B56)","v":""},null,null,null,null,null,null,null,null,null,null,null,null,null,null,null,{"$f":"IF(Debts!B160=\"\",\"\",Debts!B160)","v":""},null,null,null,null,null,null,null,null,null,{"$f":"IF(Conversions!J376=TRUE,\"Y\",\"N\")","v":"N"}]
[null,null,null,null,null,null,null,null,null,null,null,null,null,null,null,null,null,{"$f":"IF(Debts!B161=\"\",\"\",Debts!B161)","v":""},null,null,null,null,null,null,null,null,null,{"$f":"IF(Conversions!J377=TRUE,\"Y\",\"N\")","v":"N"}]
[null,{"$f":"'SFS v2.0'!B123","v":"(tick if you have continued on next page)"},null,null,null,null,null,null,null,null,null,null,null,false]
[null,null,"Total Priority debts",null,null,null,null,null,null,{"$f":"Conversions!$E$263","v":0},null,null,null,{"$f":"Conversions!$H$263","v":0},{"$f":"Conversions!Q557","v":0},{"$f":"Conversions!R557","v":0},null,"Total Non - Priority debts",null,null,null,null,null,null,{"$f":"Conversions!E365","v":0},null,null,null,null,{"$f":"SUM(AD219:AF270)","v":0},{"$f":"Conversions!AG559","v":0},{"$f":"Conversions!AH559","v":0}]
[]
[null,null,null,null,null,null,null,null,null,null,null,null,null,null,null,null,null,null,null,null,null,null,null,"Token Payments",{"$f":"Debts!O209","v":0}]
[]
[]
[]
[null,"Debts (continued)"]
[]
[null,"Priority Debts",null,null,null,null,null,null,null,null,null,null,null,null,null,null,null,"Non - Priority Debts"]
[]
[null,"Creditor",null,null,null,null,null,null,null,"Owed (£) ",null,null,null,"Offer",null,null,null,"Creditor",null,null,null,null,null,null,"Owed (£) ",null,null,"CCJ",null,"Offer"]
[null,{"$f":"'SFS v2.0'!B147","v":""},null,null,null,null,null,null,null,{"$f":"'SFS v2.0'!J147","v":""},null,null,null,{"$f":"'SFS v2.0'!N147","v":""},null,null,null,{"$f":"'SFS v2.0'!R147","v":""},null,null,null,null,null,null,{"$f":"'SFS v2.0'!Y147","v":""},null,null,{"$f":"'SFS v2.0'!AB147","v":"N"},null,{"$f":"'SFS v2.0'!AD147","v":""}]
[null,{"$f":"'SFS v2.0'!B148","v":""},null,null,null,null,null,null,null,{"$f":"'SFS v2.0'!J148","v":""},null,null,null,{"$f":"'SFS v2.0'!N148","v":""},null,null,null,{"$f":"'SFS v2.0'!R148","v":""},null,null,null,null,null,null,{"$f":"'SFS v2.0'!Y148","v":""},null,null,{"$f":"'SFS v2.0'!AB148","v":"N"},null,{"$f":"'SFS v2.0'!AD148","v":""}]
[null,{"$f":"'SFS v2.0'!B149","v":""},null,null,null,null,null,null,null,{"$f":"'SFS v2.0'!J149","v":""},null,null,null,{"$f":"'SFS v2.0'!N149","v":""},null,null,null,{"$f":"'SFS v2.0'!R149","v":""},null,null,null,null,null,null,{"$f":"'SFS v2.0'!Y149","v":""},null,null,{"$f":"'SFS v2.0'!AB149","v":"N"},null,{"$f":"'SFS v2.0'!AD149","v":""}]
[null,{"$f":"'SFS v2.0'!B150","v":""},null,null,null,null,null,null,null,{"$f":"'SFS v2.0'!J150","v":""},null,null,null,{"$f":"'SFS v2.0'!N150","v":""},null,null,null,{"$f":"'SFS v2.0'!R150","v":""},null,null,null,null,null,null,{"$f":"'SFS v2.0'!Y150","v":""},null,null,{"$f":"'SFS v2.0'!AB150","v":"N"},null,{"$f":"'SFS v2.0'!AD150","v":""}]
[null,{"$f":"'SFS v2.0'!B151","v":""},null,null,null,null,null,null,null,{"$f":"'SFS v2.0'!J151","v":""},null,null,null,{"$f":"'SFS v2.0'!N151","v":""},null,null,null,{"$f":"'SFS v2.0'!R151","v":""},null,null,null,null,null,null,{"$f":"'SFS v2.0'!Y151","v":""},null,null,{"$f":"'SFS v2.0'!AB151","v":"N"},null,{"$f":"'SFS v2.0'!AD151","v":""}]
[null,{"$f":"'SFS v2.0'!B152","v":""},null,null,null,null,null,null,null,{"$f":"'SFS v2.0'!J152","v":""},null,null,null,{"$f":"'SFS v2.0'!N152","v":""},null,null,null,{"$f":"'SFS v2.0'!R152","v":""},null,null,null,null,null,null,{"$f":"'SFS v2.0'!Y152","v":""},null,null,{"$f":"'SFS v2.0'!AB152","v":"N"},null,{"$f":"'SFS v2.0'!AD152","v":""}]
[null,{"$f":"'SFS v2.0'!B153","v":""},null,null,null,null,null,null,null,{"$f":"'SFS v2.0'!J153","v":""},null,null,null,{"$f":"'SFS v2.0'!N153","v":""},null,null,null,{"$f":"'SFS v2.0'!R153","v":""},null,null,null,null,null,null,{"$f":"'SFS v2.0'!Y153","v":""},null,null,{"$f":"'SFS v2.0'!AB153","v":"N"},null,{"$f":"'SFS v2.0'!AD153","v":""}]
[null,{"$f":"'SFS v2.0'!B154","v":""},null,null,null,null,null,null,null,{"$f":"'SFS v2.0'!J154","v":""},null,null,null,{"$f":"'SFS v2.0'!N154","v":""},null,null,null,{"$f":"'SFS v2.0'!R154","v":""},null,null,null,null,null,null,{"$f":"'SFS v2.0'!Y154","v":""},null,null,{"$f":"'SFS v2.0'!AB154","v":"N"},null,{"$f":"'SFS v2.0'!AD154","v":""}]
[null,{"$f":"'SFS v2.0'!B155","v":""},null,null,null,null,null,null,null,{"$f":"'SFS v2.0'!J155","v":""},null,null,null,{"$f":"'SFS v2.0'!N155","v":""},null,null,null,{"$f":"'SFS v2.0'!R155","v":""},null,null,null,null,null,null,{"$f":"'SFS v2.0'!Y155","v":""},null,null,{"$f":"'SFS v2.0'!AB155","v":"N"},null,{"$f":"'SFS v2.0'!AD155","v":""}]
[null,{"$f":"'SFS v2.0'!B156","v":""},null,null,null,null,null,null,null,{"$f":"'SFS v2.0'!J156","v":""},null,null,null,{"$f":"'SFS v2.0'!N156","v":""},null,null,null,{"$f":"'SFS v2.0'!R156","v":""},null,null,null,null,null,null,{"$f":"'SFS v2.0'!Y156","v":""},null,null,{"$f":"'SFS v2.0'!AB156","v":"N"},null,{"$f":"'SFS v2.0'!AD156","v":""}]
[null,{"$f":"'SFS v2.0'!B157","v":""},null,null,null,null,null,null,null,{"$f":"'SFS v2.0'!J157","v":""},null,null,null,{"$f":"'SFS v2.0'!N157","v":""},null,null,null,{"$f":"'SFS v2.0'!R157","v":""},null,null,null,null,null,null,{"$f":"'SFS v2.0'!Y157","v":""},null,null,{"$f":"'SFS v2.0'!AB157","v":"N"},null,{"$f":"'SFS v2.0'!AD157","v":""}]
[null,{"$f":"'SFS v2.0'!B158","v":""},null,null,null,null,null,null,null,{"$f":"'SFS v2.0'!J158","v":""},null,null,null,{"$f":"'SFS v2.0'!N158","v":""},null,null,null,{"$f":"'SFS v2.0'!R158","v":""},null,null,null,null,null,null,{"$f":"'SFS v2.0'!Y158","v":""},null,null,{"$f":"'SFS v2.0'!AB158","v":"N"},null,{"$f":"'SFS v2.0'!AD158","v":""}]
[null,{"$f":"'SFS v2.0'!B159","v":""},null,null,null,null,null,null,null,{"$f":"'SFS v2.0'!J159","v":""},null,null,null,{"$f":"'SFS v2.0'!N159","v":""},null,null,null,{"$f":"'SFS v2.0'!R159","v":""},null,null,null,null,null,null,{"$f":"'SFS v2.0'!Y159","v":""},null,null,{"$f":"'SFS v2.0'!AB159","v":"N"},null,{"$f":"'SFS v2.0'!AD159","v":""}]
[null,{"$f":"'SFS v2.0'!B160","v":""},null,null,null,null,null,null,null,{"$f":"'SFS v2.0'!J160","v":""},null,null,null,{"$f":"'SFS v2.0'!N160","v":""},null,null,null,{"$f":"'SFS v2.0'!R160","v":""},null,null,null,null,null,null,{"$f":"'SFS v2.0'!Y160","v":""},null,null,{"$f":"'SFS v2.0'!AB160","v":"N"},null,{"$f":"'SFS v2.0'!AD160","v":""}]
[null,{"$f":"'SFS v2.0'!B161","v":""},null,null,null,null,null,null,null,{"$f":"'SFS v2.0'!J161","v":""},null,null,null,{"$f":"'SFS v2.0'!N161","v":""},null,null,null,{"$f":"'SFS v2.0'!R161","v":""},null,null,null,null,null,null,{"$f":"'SFS v2.0'!Y161","v":""},null,null,{"$f":"'SFS v2.0'!AB161","v":"N"},null,{"$f":"'SFS v2.0'!AD161","v":""}]
[null,{"$f":"'SFS v2.0'!B162","v":""},null,null,null,null,null,null,null,{"$f":"'SFS v2.0'!J162","v":""},null,null,null,{"$f":"'SFS v2.0'!N162","v":""},null,null,null,{"$f":"'SFS v2.0'!R162","v":""},null,null,null,null,null,null,{"$f":"'SFS v2.0'!Y162","v":""},null,null,{"$f":"'SFS v2.0'!AB162","v":"N"},null,{"$f":"'SFS v2.0'!AD162","v":""}]
[null,{"$f":"'SFS v2.0'!B163","v":""},null,null,null,null,null,null,null,{"$f":"'SFS v2.0'!J163","v":""},null,null,null,{"$f":"'SFS v2.0'!N163","v":""},null,null,null,{"$f":"'SFS v2.0'!R163","v":""},null,null,null,null,null,null,{"$f":"'SFS v2.0'!Y163","v":""},null,null,{"$f":"'SFS v2.0'!AB163","v":"N"},null,{"$f":"'SFS v2.0'!AD163","v":""}]
[null,{"$f":"'SFS v2.0'!B164","v":""},null,null,null,null,null,null,null,{"$f":"'SFS v2.0'!J164","v":""},null,null,null,{"$f":"'SFS v2.0'!N164","v":""},null,null,null,{"$f":"'SFS v2.0'!R164","v":""},null,null,null,null,null,null,{"$f":"'SFS v2.0'!Y164","v":""},null,null,{"$f":"'SFS v2.0'!AB164","v":"N"},null,{"$f":"'SFS v2.0'!AD164","v":""}]
[null,{"$f":"'SFS v2.0'!B165","v":""},null,null,null,null,null,null,null,{"$f":"'SFS v2.0'!J165","v":""},null,null,null,{"$f":"'SFS v2.0'!N165","v":""},null,null,null,{"$f":"'SFS v2.0'!R165","v":""},null,null,null,null,null,null,{"$f":"'SFS v2.0'!Y165","v":""},null,null,{"$f":"'SFS v2.0'!AB165","v":"N"},null,{"$f":"'SFS v2.0'!AD165","v":""}]
[null,{"$f":"'SFS v2.0'!B166","v":""},null,null,null,null,null,null,null,{"$f":"'SFS v2.0'!J166","v":""},null,null,null,{"$f":"'SFS v2.0'!N166","v":""},null,null,null,{"$f":"'SFS v2.0'!R166","v":""},null,null,null,null,null,null,{"$f":"'SFS v2.0'!Y166","v":""},null,null,{"$f":"'SFS v2.0'!AB166","v":"N"},null,{"$f":"'SFS v2.0'!AD166","v":""}]
[null,{"$f":"'SFS v2.0'!B167","v":""},null,null,null,null,null,null,null,{"$f":"'SFS v2.0'!J167","v":""},null,null,null,{"$f":"'SFS v2.0'!N167","v":""},null,null,null,{"$f":"'SFS v2.0'!R167","v":""},null,null,null,null,null,null,{"$f":"'SFS v2.0'!Y167","v":""},null,null,{"$f":"'SFS v2.0'!AB167","v":"N"},null,{"$f":"'SFS v2.0'!AD167","v":""}]
[null,{"$f":"'SFS v2.0'!B168","v":""},null,null,null,null,null,null,null,{"$f":"'SFS v2.0'!J168","v":""},null,null,null,{"$f":"'SFS v2.0'!N168","v":""},null,null,null,{"$f":"'SFS v2.0'!R168","v":""},null,null,null,null,null,null,{"$f":"'SFS v2.0'!Y168","v":""},null,null,{"$f":"'SFS v2.0'!AB168","v":"N"},null,{"$f":"'SFS v2.0'!AD168","v":""}]
[null,{"$f":"'SFS v2.0'!B169","v":""},null,null,null,null,null,null,null,{"$f":"'SFS v2.0'!J169","v":""},null,null,null,{"$f":"'SFS v2.0'!N169","v":""},null,null,null,{"$f":"'SFS v2.0'!R169","v":""},null,null,null,null,null,null,{"$f":"'SFS v2.0'!Y169","v":""},null,null,{"$f":"'SFS v2.0'!AB169","v":"N"},null,{"$f":"'SFS v2.0'!AD169","v":""}]
[null,{"$f":"'SFS v2.0'!B170","v":""},null,null,null,null,null,null,null,{"$f":"'SFS v2.0'!J170","v":""},null,null,null,{"$f":"'SFS v2.0'!N170","v":""},null,null,null,{"$f":"'SFS v2.0'!R170","v":""},null,null,null,null,null,null,{"$f":"'SFS v2.0'!Y170","v":""},null,null,{"$f":"'SFS v2.0'!AB170","v":"N"},null,{"$f":"'SFS v2.0'!AD170","v":""}]
[null,{"$f":"'SFS v2.0'!B171","v":""},null,null,null,null,null,null,null,{"$f":"'SFS v2.0'!J171","v":""},null,null,null,{"$f":"'SFS v2.0'!N171","v":""},null,null,null,{"$f":"'SFS v2.0'!R171","v":""},null,null,null,null,null,null,{"$f":"'SFS v2.0'!Y171","v":""},null,null,{"$f":"'SFS v2.0'!AB171","v":"N"},null,{"$f":"'SFS v2.0'!AD171","v":""}]
[null,{"$f":"'SFS v2.0'!B172","v":""},null,null,null,null,null,null,null,{"$f":"'SFS v2.0'!J172","v":""},null,null,null,{"$f":"'SFS v2.0'!N172","v":""},null,null,null,{"$f":"'SFS v2.0'!R172","v":""},null,null,null,null,null,null,{"$f":"'SFS v2.0'!Y172","v":""},null,null,{"$f":"'SFS v2.0'!AB172","v":"N"},null,{"$f":"'SFS v2.0'!AD172","v":""}]
[null,{"$f":"'SFS v2.0'!B173","v":""},null,null,null,null,null,null,null,{"$f":"'SFS v2.0'!J173","v":""},null,null,null,{"$f":"'SFS v2.0'!N173","v":""},null,null,null,{"$f":"'SFS v2.0'!R173","v":""},null,null,null,null,null,null,{"$f":"'SFS v2.0'!Y173","v":""},null,null,{"$f":"'SFS v2.0'!AB173","v":"N"},null,{"$f":"'SFS v2.0'!AD173","v":""}]
[null,{"$f":"'SFS v2.0'!B174","v":""},null,null,null,null,null,null,null,{"$f":"'SFS v2.0'!J174","v":""},null,null,null,{"$f":"'SFS v2.0'!N174","v":""},null,null,null,{"$f":"'SFS v2.0'!R174","v":""},null,null,null,null,null,null,{"$f":"'SFS v2.0'!Y174","v":""},null,null,{"$f":"'SFS v2.0'!AB174","v":"N"},null,{"$f":"'SFS v2.0'!AD174","v":""}]
[null,{"$f":"'SFS v2.0'!B175","v":""},null,null,null,null,null,null,null,{"$f":"'SFS v2.0'!J175","v":""},null,null,null,{"$f":"'SFS v2.0'!N175","v":""},null,null,null,{"$f":"'SFS v2.0'!R175","v":""},null,null,null,null,null,null,{"$f":"'SFS v2.0'!Y175","v":""},null,null,{"$f":"'SFS v2.0'!AB175","v":"N"},null,{"$f":"'SFS v2.0'!AD175","v":""}]
[null,{"$f":"'SFS v2.0'!B176","v":""},null,null,null,null,null,null,null,{"$f":"'SFS v2.0'!J176","v":""},null,null,null,{"$f":"'SFS v2.0'!N176","v":""},null,null,null,{"$f":"'SFS v2.0'!R176","v":""},null,null,null,null,null,null,{"$f":"'SFS v2.0'!Y176","v":""},null,null,{"$f":"'SFS v2.0'!AB176","v":"N"},null,{"$f":"'SFS v2.0'!AD176","v":""}]
[null,{"$f":"'SFS v2.0'!B177","v":""},null,null,null,null,null,null,null,{"$f":"'SFS v2.0'!J177","v":""},null,null,null,{"$f":"'SFS v2.0'!N177","v":""},null,null,null,{"$f":"'SFS v2.0'!R177","v":""},null,null,null,null,null,null,{"$f":"'SFS v2.0'!Y177","v":""},null,null,{"$f":"'SFS v2.0'!AB177","v":"N"},null,{"$f":"'SFS v2.0'!AD177","v":""}]
[null,{"$f":"'SFS v2.0'!B178","v":""},null,null,null,null,null,null,null,{"$f":"'SFS v2.0'!J178","v":""},null,null,null,{"$f":"'SFS v2.0'!N178","v":""},null,null,null,{"$f":"'SFS v2.0'!R178","v":""},null,null,null,null,null,null,{"$f":"'SFS v2.0'!Y178","v":""},null,null,{"$f":"'SFS v2.0'!AB178","v":"N"},null,{"$f":"'SFS v2.0'!AD178","v":""}]
[null,{"$f":"'SFS v2.0'!B179","v":""},null,null,null,null,null,null,null,{"$f":"'SFS v2.0'!J179","v":""},null,null,null,{"$f":"'SFS v2.0'!N179","v":""},null,null,null,{"$f":"'SFS v2.0'!R179","v":""},null,null,null,null,null,null,{"$f":"'SFS v2.0'!Y179","v":""},null,null,{"$f":"'SFS v2.0'!AB179","v":"N"},null,{"$f":"'SFS v2.0'!AD179","v":""}]
[null,{"$f":"'SFS v2.0'!B180","v":""},null,null,null,null,null,null,null,{"$f":"'SFS v2.0'!J180","v":""},null,null,null,{"$f":"'SFS v2.0'!N180","v":""},null,null,null,{"$f":"'SFS v2.0'!R180","v":""},null,null,null,null,null,null,{"$f":"'SFS v2.0'!Y180","v":""},null,null,{"$f":"'SFS v2.0'!AB180","v":"N"},null,{"$f":"'SFS v2.0'!AD180","v":""}]
[null,{"$f":"'SFS v2.0'!B181","v":""},null,null,null,null,null,null,null,{"$f":"'SFS v2.0'!J181","v":""},null,null,null,{"$f":"'SFS v2.0'!N181","v":""},null,null,null,{"$f":"'SFS v2.0'!R181","v":""},null,null,null,null,null,null,{"$f":"'SFS v2.0'!Y181","v":""},null,null,{"$f":"'SFS v2.0'!AB181","v":"N"},null,{"$f":"'SFS v2.0'!AD181","v":""}]
[null,{"$f":"'SFS v2.0'!B182","v":""},null,null,null,null,null,null,null,{"$f":"'SFS v2.0'!J182","v":""},null,null,null,{"$f":"'SFS v2.0'!N182","v":""},null,null,null,{"$f":"'SFS v2.0'!R182","v":""},null,null,null,null,null,null,{"$f":"'SFS v2.0'!Y182","v":""},null,null,{"$f":"'SFS v2.0'!AB182","v":"N"},null,{"$f":"'SFS v2.0'!AD182","v":""}]
[null,{"$f":"'SFS v2.0'!B183","v":""},null,null,null,null,null,null,null,{"$f":"'SFS v2.0'!J183","v":""},null,null,null,{"$f":"'SFS v2.0'!N183","v":""},null,null,null,{"$f":"'SFS v2.0'!R183","v":""},null,null,null,null,null,null,{"$f":"'SFS v2.0'!Y183","v":""},null,null,{"$f":"'SFS v2.0'!AB183","v":"N"},null,{"$f":"'SFS v2.0'!AD183","v":""}]
[null,{"$f":"'SFS v2.0'!B184","v":""},null,null,null,null,null,null,null,{"$f":"'SFS v2.0'!J184","v":""},null,null,null,{"$f":"'SFS v2.0'!N184","v":""},null,null,null,{"$f":"'SFS v2.0'!R184","v":""},null,null,null,null,null,null,{"$f":"'SFS v2.0'!Y184","v":""},null,null,{"$f":"'SFS v2.0'!AB184","v":"N"},null,{"$f":"'SFS v2.0'!AD184","v":""}]
[null,{"$f":"'SFS v2.0'!B185","v":""},null,null,null,null,null,null,null,{"$f":"'SFS v2.0'!J185","v":""},null,null,null,{"$f":"'SFS v2.0'!N185","v":""},null,null,null,{"$f":"'SFS v2.0'!R185","v":""},null,null,null,null,null,null,{"$f":"'SFS v2.0'!Y185","v":""},null,null,{"$f":"'SFS v2.0'!AB185","v":"N"},null,{"$f":"'SFS v2.0'!AD185","v":""}]
[null,{"$f":"'SFS v2.0'!B186","v":""},null,null,null,null,null,null,null,{"$f":"'SFS v2.0'!J186","v":""},null,null,null,{"$f":"'SFS v2.0'!N186","v":""},null,null,null,{"$f":"'SFS v2.0'!R186","v":""},null,null,null,null,null,null,{"$f":"'SFS v2.0'!Y186","v":""},null,null,{"$f":"'SFS v2.0'!AB186","v":"N"},null,{"$f":"'SFS v2.0'!AD186","v":""}]
[null,{"$f":"'SFS v2.0'!B187","v":""},null,null,null,null,null,null,null,{"$f":"'SFS v2.0'!J187","v":""},null,null,null,{"$f":"'SFS v2.0'!N187","v":""},null,null,null,{"$f":"'SFS v2.0'!R187","v":""},null,null,null,null,null,null,{"$f":"'SFS v2.0'!Y187","v":""},null,null,{"$f":"'SFS v2.0'!AB187","v":"N"},null,{"$f":"'SFS v2.0'!AD187","v":""}]
[null,{"$f":"'SFS v2.0'!B188","v":""},null,null,null,null,null,null,null,{"$f":"'SFS v2.0'!J188","v":""},null,null,null,{"$f":"'SFS v2.0'!N188","v":""},null,null,null,{"$f":"'SFS v2.0'!R188","v":""},null,null,null,null,null,null,{"$f":"'SFS v2.0'!Y188","v":""},null,null,{"$f":"'SFS v2.0'!AB188","v":"N"},null,{"$f":"'SFS v2.0'!AD188","v":""}]
[null,{"$f":"'SFS v2.0'!B189","v":""},null,null,null,null,null,null,null,{"$f":"'SFS v2.0'!J189","v":""},null,null,null,{"$f":"'SFS v2.0'!N189","v":""},null,null,null,{"$f":"'SFS v2.0'!R189","v":""},null,null,null,null,null,null,{"$f":"'SFS v2.0'!Y189","v":""},null,null,{"$f":"'SFS v2.0'!AB189","v":"N"},null,{"$f":"'SFS v2.0'!AD189","v":""}]
[null,{"$f":"'SFS v2.0'!B190","v":""},null,null,null,null,null,null,null,{"$f":"'SFS v2.0'!J190","v":""},null,null,null,{"$f":"'SFS v2.0'!N190","v":""},null,null,null,{"$f":"'SFS v2.0'!R190","v":""},null,null,null,null,null,null,{"$f":"'SFS v2.0'!Y190","v":""},null,null,{"$f":"'SFS v2.0'!AB190","v":"N"},null,{"$f":"'SFS v2.0'!AD190","v":""}]
[null,{"$f":"'SFS v2.0'!B191","v":""},null,null,null,null,null,null,null,{"$f":"'SFS v2.0'!J191","v":""},null,null,null,{"$f":"'SFS v2.0'!N191","v":""},null,null,null,{"$f":"'SFS v2.0'!R191","v":""},null,null,null,null,null,null,{"$f":"'SFS v2.0'!Y191","v":""},null,null,{"$f":"'SFS v2.0'!AB191","v":"N"},null,{"$f":"'SFS v2.0'!AD191","v":""}]
[null,{"$f":"'SFS v2.0'!B192","v":""},null,null,null,null,null,null,null,{"$f":"'SFS v2.0'!J192","v":""},null,null,null,{"$f":"'SFS v2.0'!N192","v":""},null,null,null,{"$f":"'SFS v2.0'!R192","v":""},null,null,null,null,null,null,{"$f":"'SFS v2.0'!Y192","v":""},null,null,{"$f":"'SFS v2.0'!AB192","v":"N"},null,{"$f":"'SFS v2.0'!AD192","v":""}]
[null,{"$f":"'SFS v2.0'!B193","v":""},null,null,null,null,null,null,null,{"$f":"'SFS v2.0'!J193","v":""},null,null,null,{"$f":"'SFS v2.0'!N193","v":""},null,null,null,{"$f":"'SFS v2.0'!R193","v":""},null,null,null,null,null,null,{"$f":"'SFS v2.0'!Y193","v":""},null,null,{"$f":"'SFS v2.0'!AB193","v":"N"},null,{"$f":"'SFS v2.0'!AD193","v":""}]
[null,{"$f":"'SFS v2.0'!B194","v":""},null,null,null,null,null,null,null,{"$f":"'SFS v2.0'!J194","v":""},null,null,null,{"$f":"'SFS v2.0'!N194","v":""},null,null,null,{"$f":"'SFS v2.0'!R194","v":""},null,null,null,null,null,null,{"$f":"'SFS v2.0'!Y194","v":""},null,null,{"$f":"'SFS v2.0'!AB194","v":"N"},null,{"$f":"'SFS v2.0'!AD194","v":""}]
[null,{"$f":"'SFS v2.0'!B195","v":""},null,null,null,null,null,null,null,{"$f":"'SFS v2.0'!J195","v":""},null,null,null,{"$f":"'SFS v2.0'!N195","v":""},null,null,null,{"$f":"'SFS v2.0'!R195","v":""},null,null,null,null,null,null,{"$f":"'SFS v2.0'!Y195","v":""},null,null,{"$f":"'SFS v2.0'!AB195","v":"N"},null,{"$f":"'SFS v2.0'!AD195","v":""}]
[null,{"$f":"'SFS v2.0'!B196","v":""},null,null,null,null,null,null,null,{"$f":"'SFS v2.0'!J196","v":""},null,null,null,{"$f":"'SFS v2.0'!N196","v":""},null,null,null,{"$f":"'SFS v2.0'!R196","v":""},null,null,null,null,null,null,{"$f":"'SFS v2.0'!Y196","v":""},null,null,{"$f":"'SFS v2.0'!AB196","v":"N"},null,{"$f":"'SFS v2.0'!AD196","v":""}]
[null,{"$f":"'SFS v2.0'!B197","v":""},null,null,null,null,null,null,null,{"$f":"'SFS v2.0'!J197","v":""},null,null,null,{"$f":"'SFS v2.0'!N197","v":""},null,null,null,{"$f":"'SFS v2.0'!R197","v":""},null,null,null,null,null,null,{"$f":"'SFS v2.0'!Y197","v":""},null,null,{"$f":"'SFS v2.0'!AB197","v":"N"},null,{"$f":"'SFS v2.0'!AD197","v":""}]
[null,{"$f":"'SFS v2.0'!B198","v":""},null,null,null,null,null,null,null,{"$f":"'SFS v2.0'!J198","v":""},null,null,null,{"$f":"'SFS v2.0'!N198","v":""},null,null,null,{"$f":"'SFS v2.0'!R198","v":""},null,null,null,null,null,null,{"$f":"'SFS v2.0'!Y198","v":""},null,null,{"$f":"'SFS v2.0'!AB198","v":"N"},null,{"$f":"'SFS v2.0'!AD198","v":""}]
[]
[]
[null,null,"Total Priority debts",null,null,null,null,null,null,{"$f":"'SFS v2.0'!J201","v":0},null,null,null,{"$f":"'SFS v2.0'!N201","v":0},null,null,null,"Total Non - Priority debts",null,null,null,null,null,null,{"$f":"'SFS v2.0'!Y201","v":0},null,null,null,null,{"$f":"'SFS v2.0'!AD201","v":0}]
[]
[]
[]
[]
[]
[]
[null,null,null,null,null,null,null,null,null,null,null,null,null,null,null,null,null,null,null,null,"Tick here if continuation sheet required",null,null,null,null,null,null,null,null,null,false]
[null,{"$f":"'Notes(2)'!D2","v":"Additional notes (e.g. Reasons for debt, circumstances, temporary situations)\nPLEASE NOTE: previous comments will be shown here, please add further notes at the bottom - click show continuation sheet for all notes."}]
[null,{"$f":"IF(Notes!E7=\"\",\"\",Notes!E7)","v":"Reasons for debt, client circumstances or vulnerabilities, temporary situations, detail regarding benefits or repayment terms:"}]
[null,{"$f":"IF(Notes!E8=\"\",\"\",Notes!E8)","v":""}]
[]
[]
[]
[]
[]
[]
[null,{"$f":"IF(Notes!E15=\"\",\"\",Notes!E15)","v":"Additional Notes: "}]
[null,{"$f":"IF(Notes!E16=\"\",\"\",Notes!E16)","v":""}]
[null,{"$f":"IF(Notes!E17=\"\",\"\",Notes!E17)","v":""}]
[null,{"$f":"IF(Notes!E18=\"\",\"\",Notes!E18)","v":"Notes:"}]
[null,{"$f":"IF(Notes!E19=\"\",\"\",Notes!E19)","v":""}]
[null,{"$f":"IF(Notes!E20=\"\",\"\",Notes!E20)","v":""}]
[null,{"$f":"IF(Notes!E21=\"\",\"\",Notes!E21)","v":""}]
[null,{"$f":"IF(Notes!E22=\"\",\"\",Notes!E22)","v":""}]
[null,{"$f":"IF(Notes!E23=\"\",\"\",Notes!E23)","v":""}]
[null,{"$f":"IF(Notes!E24=\"\",\"\",Notes!E24)","v":""}]
[null,{"$f":"IF(Notes!E25=\"\",\"\",Notes!E25)","v":""}]
[null,{"$f":"IF(Notes!E26=\"\",\"\",Notes!E26)","v":""}]
[null,{"$f":"IF(Notes!E27=\"\",\"\",Notes!E27)","v":""}]
[null,{"$f":"IF(Notes!E28=\"\",\"\",Notes!E28)","v":""}]
[null,{"$f":"IF(Notes!E29=\"\",\"\",Notes!E29)","v":""}]
[null,{"$f":"IF(Notes!E30=\"\",\"\",Notes!E30)","v":""}]
[null,{"$f":"IF(Notes!E31=\"\",\"\",Notes!E31)","v":""}]
[null,{"$f":"IF(Notes!E32=\"\",\"\",Notes!E32)","v":""}]
[null,{"$f":"IF(Notes!E33=\"\",\"\",Notes!E33)","v":""}]
[null,{"$f":"IF(Notes!E34=\"\",\"\",Notes!E34)","v":""}]
[null,{"$f":"IF(Notes!E35=\"\",\"\",Notes!E35)","v":""}]
[null,{"$f":"IF(Notes!E36=\"\",\"\",Notes!E36)","v":""}]
[null,{"$f":"IF(Notes!E37=\"\",\"\",Notes!E37)","v":""}]
[null,{"$f":"IF(Notes!E38=\"\",\"\",Notes!E38)","v":""}]
[null,{"$f":"IF(Notes!E39=\"\",\"\",Notes!E39)","v":""}]
[null,{"$f":"IF(Notes!E40=\"\",\"\",Notes!E40)","v":""}]
[null,{"$f":"IF(Notes!E41=\"\",\"\",Notes!E41)","v":""}]
[null,{"$f":"IF(Notes!E42=\"\",\"\",Notes!E42)","v":""}]
[null,{"$f":"IF(Notes!E43=\"\",\"\",Notes!E43)","v":""}]
[null,{"$f":"IF(Notes!E44=\"\",\"\",Notes!E44)","v":""}]
[null,{"$f":"IF(Notes!E45=\"\",\"\",Notes!E45)","v":""}]
[null,{"$f":"IF(Notes!E46=\"\",\"\",Notes!E46)","v":""}]
[null,{"$f":"IF(Notes!E47=\"\",\"\",Notes!E47)","v":""}]
[null,{"$f":"IF(Notes!E48=\"\",\"\",Notes!E48)","v":""}]
[null,{"$f":"IF(Notes!E49=\"\",\"\",Notes!E49)","v":""}]
[null,{"$f":"IF(Notes!E50=\"\",\"\",Notes!E50)","v":""}]
[null,{"$f":"IF(Notes!E51=\"\",\"\",Notes!E51)","v":""}]
[null,{"$f":"IF(Notes!E52=\"\",\"\",Notes!E52)","v":""}]
[null,{"$f":"IF(Notes!E53=\"\",\"\",Notes!E53)","v":""}]
[null,{"$f":"IF(Notes!E54=\"\",\"\",Notes!E54)","v":""}]
[null,{"$f":"IF(Notes!E55=\"\",\"\",Notes!E55)","v":""}]
[null,{"$f":"IF(Notes!E56=\"\",\"\",Notes!E56)","v":""}]
[null,{"$f":"IF(Notes!E57=\"\",\"\",Notes!E57)","v":""}]
[null,{"$f":"IF(Notes!E58=\"\",\"\",Notes!E58)","v":""}]
[null,{"$f":"IF(Notes!E59=\"\",\"\",Notes!E59)","v":""}]
[null,{"$f":"IF(Notes!E60=\"\",\"\",Notes!E60)","v":""}]
[null,{"$f":"IF(Notes!E61=\"\",\"\",Notes!E61)","v":""}]
[null,{"$f":"IF(Notes!E62=\"\",\"\",Notes!E62)","v":""}]
[null,{"$f":"IF(Notes!E63=\"\",\"\",Notes!E63)","v":""}]
[null,{"$f":"IF(Notes!E64=\"\",\"\",Notes!E64)","v":""}]
[null,{"$f":"IF(Notes!E65=\"\",\"\",Notes!E65)","v":""}]
[null,{"$f":"IF(Notes!E66=\"\",\"\",Notes!E66)","v":""}]
[null,{"$f":"IF(Notes!E67=\"\",\"\",Notes!E67)","v":""}]
[null,{"$f":"IF(Notes!E68=\"\",\"\",Notes!E68)","v":""}]
[null,{"$f":"IF(Notes!E69=\"\",\"\",Notes!E69)","v":""}]
[null,{"$f":"IF(Notes!E70=\"\",\"\",Notes!E70)","v":""}]
[null,{"$f":"IF(Notes!E71=\"\",\"\",Notes!E71)","v":""}]
[null,{"$f":"IF(Notes!E72=\"\",\"\",Notes!E72)","v":""}]
[null,{"$f":"IF(Notes!E73=\"\",\"\",Notes!E73)","v":""}]
[null,{"$f":"IF(Notes!E74=\"\",\"\",Notes!E74)","v":""}]
[null,{"$f":"IF(Notes!E75=\"\",\"\",Notes!E75)","v":""}]
[null,{"$f":"IF(Notes!E76=\"\",\"\",Notes!E76)","v":""}]
[null,{"$f":"IF(Notes!E77=\"\",\"\",Notes!E77)","v":""}]
[null,{"$f":"IF(Notes!E78=\"\",\"\",Notes!E78)","v":""}]
[null,{"$f":"IF(Notes!E79=\"\",\"\",Notes!E79)","v":""}]
[null,{"$f":"IF(Notes!E80=\"\",\"\",Notes!E80)","v":""}]
[null,{"$f":"IF(Notes!E81=\"\",\"\",Notes!E81)","v":""}]
[null,{"$f":"IF(Notes!E82=\"\",\"\",Notes!E82)","v":""}]
[null,{"$f":"IF(Notes!E83=\"\",\"\",Notes!E83)","v":""}]
[null,{"$f":"IF(Notes!E84=\"\",\"\",Notes!E84)","v":""}]
[null,{"$f":"IF(Notes!E85=\"\",\"\",Notes!E85)","v":""}]
[null,{"$f":"IF(Notes!E86=\"\",\"\",Notes!E86)","v":""}]
[null,{"$f":"IF(Notes!E87=\"\",\"\",Notes!E87)","v":""}]
[null,{"$f":"IF(Notes!E88=\"\",\"\",Notes!E88)","v":""}]
[null,{"$f":"IF(Notes!E89=\"\",\"\",Notes!E89)","v":""}]
[null,{"$f":"IF(Notes!E90=\"\",\"\",Notes!E90)","v":""}]
[null,{"$f":"IF(Notes!E91=\"\",\"\",Notes!E91)","v":""}]
[null,{"$f":"IF(Notes!E92=\"\",\"\",Notes!E92)","v":""}]
[null,{"$f":"IF(Notes!E93=\"\",\"\",Notes!E93)","v":""}]
[null,{"$f":"IF(Notes!E94=\"\",\"\",Notes!E94)","v":""}]
[null,{"$f":"IF(Notes!E95=\"\",\"\",Notes!E95)","v":""}]
[null,{"$f":"IF(Notes!E96=\"\",\"\",Notes!E96)","v":""}]
[null,{"$f":"IF(Notes!E97=\"\",\"\",Notes!E97)","v":""}]
[null,{"$f":"IF(Notes!E98=\"\",\"\",Notes!E98)","v":""}]
[null,{"$f":"IF(Notes!E99=\"\",\"\",Notes!E99)","v":""}]
[null,{"$f":"IF(Notes!E100=\"\",\"\",Notes!E100)","v":""}]
[null,{"$f":"IF(Notes!E101=\"\",\"\",Notes!E101)","v":""}]
[null,{"$f":"IF(Notes!E102=\"\",\"\",Notes!E102)","v":""}]
[null,{"$f":"IF(Notes!E103=\"\",\"\",Notes!E103)","v":""}]
[null,{"$f":"IF(Notes!E104=\"\",\"\",Notes!E104)","v":""}]
[null,{"$f":"IF(Notes!E105=\"\",\"\",Notes!E105)","v":""}]
[null,{"$f":"IF(Notes!E106=\"\",\"\",Notes!E106)","v":""}]
[null,{"$f":"IF(Notes!E107=\"\",\"\",Notes!E107)","v":""}]
[null,{"$f":"IF(Notes!E108=\"\",\"\",Notes!E108)","v":""}]
[null,{"$f":"IF(Notes!E109=\"\",\"\",Notes!E109)","v":""}]
[null,{"$f":"IF(Notes!E110=\"\",\"\",Notes!E110)","v":""}]
[null,{"$f":"IF(Notes!E111=\"\",\"\",Notes!E111)","v":""}]
[null,{"$f":"IF(Notes!E112=\"\",\"\",Notes!E112)","v":""}]
[null,{"$f":"IF(Notes!E113=\"\",\"\",Notes!E113)","v":""}]
[null,{"$f":"IF(Notes!E114=\"\",\"\",Notes!E114)","v":""}]
[null,{"$f":"IF(Notes!E115=\"\",\"\",Notes!E115)","v":""}]
[null,{"$f":"IF(Notes!E116=\"\",\"\",Notes!E116)","v":""}]
[null,{"$f":"IF(Notes!E117=\"\",\"\",Notes!E117)","v":""}]
[null,{"$f":"IF(Notes!E118=\"\",\"\",Notes!E118)","v":""}]
[null,{"$f":"IF(Notes!E119=\"\",\"\",Notes!E119)","v":""}]
[null,{"$f":"IF(Notes!E120=\"\",\"\",Notes!E120)","v":""}]
[null,{"$f":"IF(Notes!E121=\"\",\"\",Notes!E121)","v":""}]
[null,{"$f":"IF(Notes!E122=\"\",\"\",Notes!E122)","v":""}]
[null,{"$f":"IF(Notes!E123=\"\",\"\",Notes!E123)","v":""}]
[null,{"$f":"IF(Notes!E124=\"\",\"\",Notes!E124)","v":""}]
[null,{"$f":"IF(Notes!E125=\"\",\"\",Notes!E125)","v":""}]
[null,{"$f":"IF(Notes!E126=\"\",\"\",Notes!E126)","v":""}]
[null,{"$f":"IF(Notes!E127=\"\",\"\",Notes!E127)","v":""}]
[null,{"$f":"IF(Notes!E128=\"\",\"\",Notes!E128)","v":""}]
[null,{"$f":"IF(Notes!E129=\"\",\"\",Notes!E129)","v":""}]
[null,{"$f":"IF(Notes!E130=\"\",\"\",Notes!E130)","v":""}]
[null,{"$f":"IF(Notes!E131=\"\",\"\",Notes!E131)","v":""}]
[null,{"$f":"IF(Notes!E132=\"\",\"\",Notes!E132)","v":""}]
[null,{"$f":"IF(Notes!E133=\"\",\"\",Notes!E133)","v":""}]
[null,{"$f":"IF(Notes!E134=\"\",\"\",Notes!E134)","v":""}]
[null,{"$f":"IF(Notes!E135=\"\",\"\",Notes!E135)","v":""}]
[null,{"$f":"IF(Notes!E136=\"\",\"\",Notes!E136)","v":""}]
[null,{"$f":"IF(Notes!E137=\"\",\"\",Notes!E137)","v":""}]
[null,{"$f":"IF(Notes!E138=\"\",\"\",Notes!E138)","v":""}]
[null,{"$f":"IF(Notes!E139=\"\",\"\",Notes!E139)","v":""}]
[null,{"$f":"IF(Notes!E140=\"\",\"\",Notes!E140)","v":""}]
[null,{"$f":"IF(Notes!E141=\"\",\"\",Notes!E141)","v":""}]
[null,{"$f":"IF(Notes!E142=\"\",\"\",Notes!E142)","v":""}]
[null,{"$f":"IF(Notes!E143=\"\",\"\",Notes!E143)","v":""}]
[null,{"$f":"IF(Notes!E144=\"\",\"\",Notes!E144)","v":""}]
[null,{"$f":"IF(Notes!E145=\"\",\"\",Notes!E145)","v":""}]
[null,{"$f":"IF(Notes!E146=\"\",\"\",Notes!E146)","v":""}]
[null,{"$f":"IF(Notes!E147=\"\",\"\",Notes!E147)","v":""}]
[null,{"$f":"IF(Notes!E148=\"\",\"\",Notes!E148)","v":""}]
[null,{"$f":"IF(Notes!E149=\"\",\"\",Notes!E149)","v":""}]
[null,{"$f":"IF(Notes!E150=\"\",\"\",Notes!E150)","v":""}]
[null,{"$f":"IF(Notes!E151=\"\",\"\",Notes!E151)","v":""}]
[null,{"$f":"IF(Notes!E152=\"\",\"\",Notes!E152)","v":""}]
[null,{"$f":"IF(Notes!E153=\"\",\"\",Notes!E153)","v":""}]
[null,{"$f":"IF(Notes!E154=\"\",\"\",Notes!E154)","v":""}]
[null,{"$f":"IF(Notes!E155=\"\",\"\",Notes!E155)","v":""}]
[null,{"$f":"IF(Notes!E156=\"\",\"\",Notes!E156)","v":""}]
[null,{"$f":"IF(Notes!E157=\"\",\"\",Notes!E157)","v":""}]
[null,{"$f":"IF(Notes!E158=\"\",\"\",Notes!E158)","v":""}]
[null,{"$f":"IF(Notes!E159=\"\",\"\",Notes!E159)","v":""}]
[null,{"$f":"IF(Notes!E160=\"\",\"\",Notes!E160)","v":""}]
[null,{"$f":"IF(Notes!E161=\"\",\"\",Notes!E161)","v":""}]
[null,{"$f":"IF(Notes!E162=\"\",\"\",Notes!E162)","v":""}]
[null,{"$f":"IF(Notes!E163=\"\",\"\",Notes!E163)","v":""}]
[null,{"$f":"IF(Notes!E164=\"\",\"\",Notes!E164)","v":""}]
[null,{"$f":"IF(Notes!E165=\"\",\"\",Notes!E165)","v":""}]
[null,{"$f":"IF(Notes!E166=\"\",\"\",Notes!E166)","v":""}]
[null,{"$f":"IF(Notes!E167=\"\",\"\",Notes!E167)","v":""}]
[null,{"$f":"IF(Notes!E168=\"\",\"\",Notes!E168)","v":""}]
[null,{"$f":"IF(Notes!E169=\"\",\"\",Notes!E169)","v":""}]
[null,{"$f":"IF(Notes!E170=\"\",\"\",Notes!E170)","v":""}]
[null,{"$f":"IF(Notes!E171=\"\",\"\",Notes!E171)","v":""}]
[null,{"$f":"IF(Notes!E172=\"\",\"\",Notes!E172)","v":""}]
[null,{"$f":"IF(Notes!E173=\"\",\"\",Notes!E173)","v":""}]
[null,{"$f":"IF(Notes!E174=\"\",\"\",Notes!E174)","v":""}]
[null,{"$f":"IF(Notes!E175=\"\",\"\",Notes!E175)","v":""}]
[null,{"$f":"IF(Notes!E176=\"\",\"\",Notes!E176)","v":""}]
[null,{"$f":"IF(Notes!E177=\"\",\"\",Notes!E177)","v":""}]
[null,{"$f":"IF(Notes!E178=\"\",\"\",Notes!E178)","v":""}]
[null,{"$f":"IF(Notes!E179=\"\",\"\",Notes!E179)","v":""}]
[null,{"$f":"IF(Notes!E180=\"\",\"\",Notes!E180)","v":""}]
[null,{"$f":"IF(Notes!E181=\"\",\"\",Notes!E181)","v":""}]
[null,{"$f":"IF(Notes!E182=\"\",\"\",Notes!E182)","v":""}]
[null,{"$f":"IF(Notes!E183=\"\",\"\",Notes!E183)","v":""}]
[null,{"$f":"IF(Notes!E184=\"\",\"\",Notes!E184)","v":""}]
[null,{"$f":"IF(Notes!E185=\"\",\"\",Notes!E185)","v":""}]
[null,{"$f":"IF(Notes!E186=\"\",\"\",Notes!E186)","v":""}]
[null,{"$f":"IF(Notes!E187=\"\",\"\",Notes!E187)","v":""}]
[null,{"$f":"IF(Notes!E188=\"\",\"\",Notes!E188)","v":""}]
[null,{"$f":"IF(Notes!E189=\"\",\"\",Notes!E189)","v":""}]
[null,{"$f":"IF(Notes!E190=\"\",\"\",Notes!E190)","v":""}]
[null,{"$f":"IF(Notes!E191=\"\",\"\",Notes!E191)","v":""}]
[null,{"$f":"IF(Notes!E192=\"\",\"\",Notes!E192)","v":""}]
[null,{"$f":"IF(Notes!E193=\"\",\"\",Notes!E193)","v":""}]
[null,{"$f":"IF(Notes!E194=\"\",\"\",Notes!E194)","v":""}]
[null,{"$f":"IF(Notes!E195=\"\",\"\",Notes!E195)","v":""}]
[null,{"$f":"IF(Notes!E196=\"\",\"\",Notes!E196)","v":""}]
[null,{"$f":"IF(Notes!E197=\"\",\"\",Notes!E197)","v":""}]
[null,{"$f":"IF(Notes!E198=\"\",\"\",Notes!E198)","v":""}]
[null,{"$f":"IF(Notes!E199=\"\",\"\",Notes!E199)","v":""}]
[null,{"$f":"IF(Notes!E200=\"\",\"\",Notes!E200)","v":""}]
[null,{"$f":"IF(Notes!E201=\"\",\"\",Notes!E201)","v":""}]
[null,{"$f":"IF(Notes!E202=\"\",\"\",Notes!E202)","v":""}]
[null,{"$f":"IF(Notes!E203=\"\",\"\",Notes!E203)","v":""}]
[null,{"$f":"IF(Notes!E204=\"\",\"\",Notes!E204)","v":""}]
[null,{"$f":"IF(Notes!E205=\"\",\"\",Notes!E205)","v":""}]
[null,{"$f":"IF(Notes!E206=\"\",\"\",Notes!E206)","v":""}]
[null,{"$f":"IF(Notes!E207=\"\",\"\",Notes!E207)","v":""}]
[null,{"$f":"IF(Notes!E208=\"\",\"\",Notes!E208)","v":""}]
[null,{"$f":"IF(Notes!E209=\"\",\"\",Notes!E209)","v":""}]
[null,{"$f":"IF(Notes!E210=\"\",\"\",Notes!E210)","v":""}]
[null,{"$f":"IF(Notes!E211=\"\",\"\",Notes!E211)","v":""}]
[null,{"$f":"IF(Notes!E212=\"\",\"\",Notes!E212)","v":""}]
[null,{"$f":"IF(Notes!E213=\"\",\"\",Notes!E213)","v":""}]
[null,{"$f":"IF(Notes!E214=\"\",\"\",Notes!E214)","v":""}]
[null,{"$f":"IF(Notes!E215=\"\",\"\",Notes!E215)","v":""}]
[null,{"$f":"IF(Notes!E216=\"\",\"\",Notes!E216)","v":""}]
[null,{"$f":"IF(Notes!E217=\"\",\"\",Notes!E217)","v":""}]
[null,{"$f":"IF(Notes!E218=\"\",\"\",Notes!E218)","v":""}]
[null,{"$f":"IF(Notes!E219=\"\",\"\",Notes!E219)","v":""}]
[null,{"$f":"IF(Notes!E220=\"\",\"\",Notes!E220)","v":""}]
[null,{"$f":"IF(Notes!E221=\"\",\"\",Notes!E221)","v":""}]
[null,{"$f":"IF(Notes!E222=\"\",\"\",Notes!E222)","v":""}]
[null,{"$f":"IF(Notes!E223=\"\",\"\",Notes!E223)","v":""}]
[null,{"$f":"IF(Notes!E224=\"\",\"\",Notes!E224)","v":""}]
[null,{"$f":"IF(Notes!E225=\"\",\"\",Notes!E225)","v":""}]
[null,{"$f":"IF(Notes!E226=\"\",\"\",Notes!E226)","v":""}]
[null,{"$f":"IF(Notes!E227=\"\",\"\",Notes!E227)","v":""}]
[null,{"$f":"IF(Notes!E228=\"\",\"\",Notes!E228)","v":""}]
[null,{"$f":"IF(Notes!E229=\"\",\"\",Notes!E229)","v":""}]
[null,{"$f":"IF(Notes!E230=\"\",\"\",Notes!E230)","v":""}]
[null,{"$f":"IF(Notes!E231=\"\",\"\",Notes!E231)","v":""}]
[null,{"$f":"IF(Notes!E232=\"\",\"\",Notes!E232)","v":""}]
[null,{"$f":"IF(Notes!E233=\"\",\"\",Notes!E233)","v":""}]
[null,{"$f":"IF(Notes!E234=\"\",\"\",Notes!E234)","v":""}]
[null,{"$f":"IF(Notes!E235=\"\",\"\",Notes!E235)","v":""}]
[null,{"$f":"IF(Notes!E236=\"\",\"\",Notes!E236)","v":""}]
[null,{"$f":"IF(Notes!E237=\"\",\"\",Notes!E237)","v":""}]
[null,{"$f":"IF(Notes!E238=\"\",\"\",Notes!E238)","v":""}]
[null,{"$f":"IF(Notes!E239=\"\",\"\",Notes!E239)","v":""}]
[null,{"$f":"IF(Notes!E240=\"\",\"\",Notes!E240)","v":""}]
[null,{"$f":"IF(Notes!E241=\"\",\"\",Notes!E241)","v":""}]
[null,{"$f":"IF(Notes!E242=\"\",\"\",Notes!E242)","v":""}]
[null,{"$f":"IF(Notes!E243=\"\",\"\",Notes!E243)","v":""}]
[null,{"$f":"IF(Notes!E244=\"\",\"\",Notes!E244)","v":""}]
[null,{"$f":"IF(Notes!E245=\"\",\"\",Notes!E245)","v":""}]
[null,{"$f":"IF(Notes!E246=\"\",\"\",Notes!E246)","v":""}]
[null,{"$f":"IF(Notes!E247=\"\",\"\",Notes!E247)","v":""}]
[null,{"$f":"IF(Notes!E248=\"\",\"\",Notes!E248)","v":""}]
[null,{"$f":"IF(Notes!E249=\"\",\"\",Notes!E249)","v":""}]
[null,{"$f":"IF(Notes!E250=\"\",\"\",Notes!E250)","v":""}]
[null,{"$f":"IF(Notes!E251=\"\",\"\",Notes!E251)","v":""}]
[null,{"$f":"IF(Notes!E252=\"\",\"\",Notes!E252)","v":""}]
[null,{"$f":"IF(Notes!E253=\"\",\"\",Notes!E253)","v":""}]
[null,{"$f":"IF(Notes!E254=\"\",\"\",Notes!E254)","v":""}]
[null,{"$f":"IF(Notes!E255=\"\",\"\",Notes!E255)","v":""}]
[null,{"$f":"IF(Notes!E256=\"\",\"\",Notes!E256)","v":""}]
[null,{"$f":"IF(Notes!E257=\"\",\"\",Notes!E257)","v":""}]
[null,{"$f":"IF(Notes!E258=\"\",\"\",Notes!E258)","v":""}]
[null,{"$f":"IF(Notes!E259=\"\",\"\",Notes!E259)","v":""}]
[null,{"$f":"IF(Notes!E260=\"\",\"\",Notes!E260)","v":""}]
[null,{"$f":"IF(Notes!E261=\"\",\"\",Notes!E261)","v":""}]
[null,{"$f":"IF(Notes!E262=\"\",\"\",Notes!E262)","v":""}]
[null,{"$f":"IF(Notes!E263=\"\",\"\",Notes!E263)","v":""}]
[null,{"$f":"IF(Notes!E264=\"\",\"\",Notes!E264)","v":""}]
[null,{"$f":"IF(Notes!E265=\"\",\"\",Notes!E265)","v":""}]
[null,{"$f":"IF(Notes!E266=\"\",\"\",Notes!E266)","v":""}]
[null,{"$f":"IF(Notes!E267=\"\",\"\",Notes!E267)","v":""}]
[null,{"$f":"IF(Notes!E268=\"\",\"\",Notes!E268)","v":""}]
[null,{"$f":"IF(Notes!E269=\"\",\"\",Notes!E269)","v":""}]
[null,{"$f":"IF(Notes!E270=\"\",\"\",Notes!E270)","v":""}]
[null,{"$f":"IF(Notes!E271=\"\",\"\",Notes!E271)","v":""}]
[null,{"$f":"IF(Notes!E272=\"\",\"\",Notes!E272)","v":""}]
[null,{"$f":"IF(Notes!E273=\"\",\"\",Notes!E273)","v":""}]
[null,{"$f":"IF(Notes!E274=\"\",\"\",Notes!E274)","v":""}]
[null,{"$f":"IF(Notes!E275=\"\",\"\",Notes!E275)","v":""}]
[null,{"$f":"IF(Notes!E276=\"\",\"\",Notes!E276)","v":""}]
[null,{"$f":"IF(Notes!E277=\"\",\"\",Notes!E277)","v":""}]
[null,{"$f":"IF(Notes!E278=\"\",\"\",Notes!E278)","v":""}]
[null,{"$f":"IF(Notes!E279=\"\",\"\",Notes!E279)","v":""}]
[null,{"$f":"IF(Notes!E280=\"\",\"\",Notes!E280)","v":""}]
[null,{"$f":"IF(Notes!E281=\"\",\"\",Notes!E281)","v":""}]
[null,{"$f":"IF(Notes!E282=\"\",\"\",Notes!E282)","v":""}]
[null,{"$f":"IF(Notes!E283=\"\",\"\",Notes!E283)","v":""}]
[null,{"$f":"IF(Notes!E284=\"\",\"\",Notes!E284)","v":""}]
[null,{"$f":"IF(Notes!E285=\"\",\"\",Notes!E285)","v":""}]
[null,{"$f":"IF(Notes!E286=\"\",\"\",Notes!E286)","v":""}]
[null,{"$f":"IF(Notes!E287=\"\",\"\",Notes!E287)","v":""}]
[null,{"$f":"IF(Notes!E288=\"\",\"\",Notes!E288)","v":""}]
[null,{"$f":"IF(Notes!E289=\"\",\"\",Notes!E289)","v":""}]
[null,{"$f":"IF(Notes!E290=\"\",\"\",Notes!E290)","v":""}]
[null,{"$f":"IF(Notes!E291=\"\",\"\",Notes!E291)","v":""}]
[null,{"$f":"IF(Notes!E292=\"\",\"\",Notes!E292)","v":""}]
[null,{"$f":"IF(Notes!E293=\"\",\"\",Notes!E293)","v":""}]
[null,{"$f":"IF(Notes!E294=\"\",\"\",Notes!E294)","v":""}]
[null,{"$f":"IF(Notes!E295=\"\",\"\",Notes!E295)","v":""}]
[null,{"$f":"IF(Notes!E296=\"\",\"\",Notes!E296)","v":""}]
[null,{"$f":"IF(Notes!E297=\"\",\"\",Notes!E297)","v":""}]
[null,{"$f":"IF(Notes!E298=\"\",\"\",Notes!E298)","v":""}]
[null,{"$f":"IF(Notes!E299=\"\",\"\",Notes!E299)","v":""}]
[null,{"$f":"IF(Notes!E300=\"\",\"\",Notes!E300)","v":""}]
[null,{"$f":"IF(Notes!E301=\"\",\"\",Notes!E301)","v":""}]
[null,{"$f":"IF(Notes!E302=\"\",\"\",Notes!E302)","v":""}]
[null,{"$f":"IF(Notes!E303=\"\",\"\",Notes!E303)","v":""}]
[null,{"$f":"IF(Notes!E304=\"\",\"\",Notes!E304)","v":""}]
[null,{"$f":"IF(Notes!E305=\"\",\"\",Notes!E305)","v":""}]
[null,{"$f":"IF(Notes!E306=\"\",\"\",Notes!E306)","v":""}]
[null,{"$f":"IF(Notes!E307=\"\",\"\",Notes!E307)","v":""}]
[null,{"$f":"IF(Notes!E308=\"\",\"\",Notes!E308)","v":""}]
[null,{"$f":"IF(Notes!E309=\"\",\"\",Notes!E309)","v":""}]
[null,{"$f":"IF(Notes!E310=\"\",\"\",Notes!E310)","v":""}]
[null,{"$f":"IF(Notes!E311=\"\",\"\",Notes!E311)","v":""}]
[null,{"$f":"IF(Notes!E312=\"\",\"\",Notes!E312)","v":""}]
[null,{"$f":"IF(Notes!E313=\"\",\"\",Notes!E313)","v":""}]
[null,{"$f":"IF(Notes!E314=\"\",\"\",Notes!E314)","v":""}]
[null,{"$f":"IF(Notes!E315=\"\",\"\",Notes!E315)","v":""}]
[null,{"$f":"IF(Notes!E316=\"\",\"\",Notes!E316)","v":""}]
[null,{"$f":"IF(Notes!E317=\"\",\"\",Notes!E317)","v":""}]
[null,{"$f":"IF(Notes!E318=\"\",\"\",Notes!E318)","v":""}]
[null,{"$f":"IF(Notes!E319=\"\",\"\",Notes!E319)","v":""}]
[null,{"$f":"IF(Notes!E320=\"\",\"\",Notes!E320)","v":""}]
[null,{"$f":"IF(Notes!E321=\"\",\"\",Notes!E321)","v":""}]
[null,{"$f":"IF(Notes!E322=\"\",\"\",Notes!E322)","v":""}]
[null,{"$f":"IF(Notes!E323=\"\",\"\",Notes!E323)","v":""}]
[null,{"$f":"IF(Notes!E324=\"\",\"\",Notes!E324)","v":""}]
[null,{"$f":"IF(Notes!E325=\"\",\"\",Notes!E325)","v":""}]
[null,{"$f":"IF(Notes!E326=\"\",\"\",Notes!E326)","v":""}]
[null,{"$f":"IF(Notes!E327=\"\",\"\",Notes!E327)","v":""}]
[null,{"$f":"IF(Notes!E328=\"\",\"\",Notes!E328)","v":""}]
[null,{"$f":"IF(Notes!E329=\"\",\"\",Notes!E329)","v":""}]
[null,{"$f":"IF(Notes!E330=\"\",\"\",Notes!E330)","v":""}]
[null,{"$f":"IF(Notes!E331=\"\",\"\",Notes!E331)","v":""}]
[null,{"$f":"IF(Notes!E332=\"\",\"\",Notes!E332)","v":""}]
[null,{"$f":"IF(Notes!E333=\"\",\"\",Notes!E333)","v":""}]
[null,{"$f":"IF(Notes!E334=\"\",\"\",Notes!E334)","v":""}]
[null,{"$f":"IF(Notes!E335=\"\",\"\",Notes!E335)","v":""}]
[null,{"$f":"IF(Notes!E336=\"\",\"\",Notes!E336)","v":""}]
[null,{"$f":"IF(Notes!E337=\"\",\"\",Notes!E337)","v":""}]
[null,{"$f":"IF(Notes!E338=\"\",\"\",Notes!E338)","v":""}]
[null,{"$f":"IF(Notes!E339=\"\",\"\",Notes!E339)","v":""}]
[]
[]
[]
[]
[]
[]
[]
[]
[]
[null,"This financial statement is an accurate record of the information provided."]
[]
[]
[null,"Signed:                                                                                               Date:"]

{"sheet":"Conversions","index":12,"n_rows":385,"n_cols":19,"rows_kept":385,"cut":false,"hidden":true,"merged":[[1,1,1,2]]}
[null,"CONVERSIONS SHEET"]
[null,{"$f":"TODAY()","v":"2019-04-25"}]
[]
[]
[]
[]
[null,null,null,null,null,null,null,null,null,null,null,null,null,null,null,"Include Notes","Notes"]
[]
[null,{"$f":"\"Monthly Income - \"&Income!B3","v":"Monthly Income - Earnings "},null,null,null,"£ Amount",null,"£ Monthly",null,null,null,null,null,null,null,{"$f":"IF(Q9=\"\",FALSE,TRUE)","v":false},{"$f":"IF(P10=TRUE,B9,IF(P11=TRUE,B9,IF(P12=TRUE,B9,\"\")))","v":""},null,{"$f":"IF(P10=TRUE,Q9,IF(P11=TRUE,Q9,IF(P12=TRUE,Q9,\"\")))","v":""}]
[null,{"$f":"Income!A4","v":1},{"$f":"Income!B4","v":"Salary or wages (take home)"},null,null,{"$f":"Income!D4","v":0},{"$f":"Income!F4","v":"M"},{"$f":"IF(G10=\"W\",F10*52/12,IF(OR(G10=\"M\",LEN(G10)=0),F10,IF(G10=\"Q\",F10/3,IF(G10=\"F\",F10*26/12,IF(OR(G10=\"A\",G10=\"Y\"),F10/12,F10)))))","v":0},null,null,null,null,null,null,null,{"$f":"Income!H4","v":false},{"$f":"IF(P10=TRUE,CONCATENATE(Income!B3,\" / \",Income!B4,\" / \",Income!J4),\"\")","v":""},null,{"$f":"IF(P10=TRUE,Income!J4,\"\")","v":""}]
[null,{"$f":"Income!A5","v":2},{"$f":"Income!B5","v":"Partner salary or wages (take home)"},null,null,{"$f":"Income!D5","v":0},{"$f":"Income!F5","v":"M"},{"$f":"IF(G11=\"W\",F11*52/12,IF(OR(G11=\"M\",LEN(G11)=0),F11,IF(G11=\"Q\",F11/3,IF(G11=\"F\",F11*26/12,IF(OR(G11=\"A\",G11=\"Y\"),F11/12,F11)))))","v":0},null,null,null,null,null,null,null,{"$f":"Income!H5","v":false},{"$f":"IF(P11=TRUE,CONCATENATE(Income!B3,\" / \",Income!B5,\" / \",Income!J5),\"\")","v":""},null,{"$f":"IF(P11=TRUE,Income!J5,\"\")","v":""}]
[null,{"$f":"Income!A6","v":3},{"$f":"Income!B6","v":"Other earnings (including self employment)"},null,null,{"$f":"Income!D6","v":0},{"$f":"Income!F6","v":"M"},{"$f":"IF(G12=\"W\",F12*52/12,IF(OR(G12=\"M\",LEN(G12)=0),F12,IF(G12=\"Q\",F12/3,IF(G12=\"F\",F12*26/12,IF(OR(G12=\"A\",G12=\"Y\"),F12/12,F12)))))","v":0},null,null,null,null,null,null,null,{"$f":"Income!H6","v":false},{"$f":"IF(P12=TRUE,CONCATENATE(Income!B3,\" / \",Income!B6,\" / \",Income!J6),\"\")","v":""},null,{"$f":"IF(P12=TRUE,Income!J6,\"\")","v":""}]
[null,null,null,null,null,null,null,null,null,null,null,null,null,null,null,{"$f":"IF(P9=TRUE,TRUE,FALSE)","v":false},"\"",null,{"$f":"Q13","v":"\""}]
[null,null,{"$f":"Income!B7","v":"Total salary and wages per month"},null,null,null,null,{"$f":"SUM(H10:H13)","v":0},null,null,null,null,null,null,null,null,{"$f":"IF(P14=TRUE,CONCATENATE(Income!B5,\" / \",Income!B8,\" / \",Income!J8),\"\")","v":""}]
[null,null,null,null,null,null,null,null,null,null,null,null,null,null,null,null,{"$f":"IF(P15=TRUE,CONCATENATE(Income!B6,\" / \",Income!B9,\" / \",Income!J9),\"\")","v":""}]
[null,{"$f":"\"Monthly Income - \"&Income!B9","v":"Monthly Income - Benefits and tax credits"},null,null,null,"£ Amount",null,"£ Monthly",null,null,null,null,null,null,null,{"$f":"IF(Q16=\"\",FALSE,TRUE)","v":false},{"$f":"IF(P17=TRUE,B16,IF(P18=TRUE,B16,IF(P19=TRUE,B16,IF(P20=TRUE,B16,IF(P21=TRUE,B16,IF(P22=TRUE,B16,IF(P23=TRUE,B16,IF(P24=TRUE,B16,IF(P25=TRUE,B16,IF(P26=TRUE,B16,IF(P27=TRUE,B16,IF(P28=TRUE,B16,IF(P29=TRUE,B16,\"\")))))))))))))","v":""},null,{"$f":"IF(P17=TRUE,Q16,IF(P18=TRUE,Q16,IF(P19=TRUE,Q16,IF(P20=TRUE,Q16,IF(P21=TRUE,Q16,IF(P22=TRUE,Q16,IF(P23=TRUE,Q16,IF(P24=TRUE,Q16,IF(P25=TRUE,Q16,IF(P26=TRUE,Q16,IF(P27=TRUE,Q16,IF(P28=TRUE,Q16,IF(P29=TRUE,Q16,\"\")))))))))))))","v":""}]
[null,{"$f":"Income!A10","v":4},{"$f":"Income!B10","v":"Universal Credit"},null,null,{"$f":"Income!D10","v":0},{"$f":"Income!F10","v":"M"},{"$f":"IF(G17=\"W\",F17*52/12,IF(OR(G17=\"M\",LEN(G17)=0),F17,IF(G17=\"Q\",F17/3,IF(G17=\"F\",F17*26/12,IF(OR(G17=\"A\",G17=\"Y\"),F17/12,F17)))))","v":0},null,null,null,null,null,null,null,{"$f":"Income!H10","v":false},{"$f":"IF(P17=TRUE,CONCATENATE(Income!$B$9,\" / \",Income!B10,\" / \",Income!J10),\"\")","v":""},null,{"$f":"IF(P17=TRUE,Income!J10,\"\")","v":""}]
[null,{"$f":"Income!A11","v":5},{"$f":"Income!B11","v":"Jobseeker’s Allowance (income based)"},null,null,{"$f":"Income!D11","v":0},{"$f":"Income!F11","v":"M"},{"$f":"IF(G18=\"W\",F18*52/12,IF(OR(G18=\"M\",LEN(G18)=0),F18,IF(G18=\"Q\",F18/3,IF(G18=\"F\",F18*26/12,IF(OR(G18=\"A\",G18=\"Y\"),F18/12,F18)))))","v":0},null,null,null,null,null,null,null,{"$f":"Income!H11","v":false},{"$f":"IF(P18=TRUE,CONCATENATE(Income!$B$9,\" / \",Income!B11,\" / \",Income!J11),\"\")","v":""},null,{"$f":"IF(P18=TRUE,Income!J11,\"\")","v":""}]
[null,{"$f":"Income!A12","v":6},{"$f":"Income!B12","v":"Jobseeker’s Allowance (contribution based)"},null,null,{"$f":"Income!D12","v":0},{"$f":"Income!F12","v":"M"},0,null,null,null,null,null,null,null,{"$f":"Income!H12","v":false},{"$f":"IF(P19=TRUE,CONCATENATE(Income!$B$9,\" / \",Income!B12,\" / \",Income!J12),\"\")","v":""},null,{"$f":"IF(P19=TRUE,Income!J12,\"\")","v":""}]
[null,{"$f":"Income!A13","v":7},{"$f":"Income!B13","v":"Income Support"},null,null,{"$f":"Income!D13","v":0},{"$f":"Income!F13","v":"M"},0,null,null,null,null,null,null,null,{"$f":"Income!H13","v":false},{"$f":"IF(P20=TRUE,CONCATENATE(Income!$B$9,\" / \",Income!B13,\" / \",Income!J13),\"\")","v":""},null,{"$f":"IF(P20=TRUE,Income!J13,\"\")","v":""}]
[null,{"$f":"Income!A14","v":8},{"$f":"Income!B14","v":"Working Tax Credit"},null,null,{"$f":"Income!D14","v":0},{"$f":"Income!F14","v":"M"},0,null,null,null,null,null,null,null,{"$f":"Income!H14","v":false},{"$f":"IF(P21=TRUE,CONCATENATE(Income!$B$9,\" / \",Income!B14,\" / \",Income!J14),\"\")","v":""},null,{"$f":"IF(P21=TRUE,Income!J14,\"\")","v":""}]
[null,{"$f":"Income!A15","v":9},{"$f":"Income!B15","v":"Child Tax Credit"},null,null,{"$f":"Income!D15","v":0},{"$f":"Income!F15","v":"M"},0,null,null,null,null,null,null,null,{"$f":"Income!H15","v":false},{"$f":"IF(P22=TRUE,CONCATENATE(Income!$B$9,\" / \",Income!B15,\" / \",Income!J15),\"\")","v":""},null,{"$f":"IF(P22=TRUE,Income!J15,\"\")","v":""}]
[null,{"$f":"Income!A16","v":10},{"$f":"Income!B16","v":"Child Benefit"},null,null,{"$f":"Income!D16","v":0},{"$f":"Income!F16","v":"M"},0,null,null,null,null,null,null,null,{"$f":"Income!H16","v":false},{"$f":"IF(P23=TRUE,CONCATENATE(Income!$B$9,\" / \",Income!B16,\" / \",Income!J16),\"\")","v":""},null,{"$f":"IF(P23=TRUE,Income!J16,\"\")","v":""}]
[null,{"$f":"Income!A17","v":11},{"$f":"Income!B17","v":"Employment and Support Allowance or Statutory Sick Pay"},null,null,{"$f":"Income!D17","v":0},{"$f":"Income!F17","v":"M"},0,null,null,null,null,null,null,null,{"$f":"Income!H17","v":false},{"$f":"IF(P24=TRUE,CONCATENATE(Income!$B$9,\" / \",Income!B17,\" / \",Income!J17),\"\")","v":""},null,{"$f":"IF(P24=TRUE,Income!J17,\"\")","v":""}]
[null,{"$f":"Income!A18","v":12},{"$f":"Income!B18","v":"Disability benefits"},null,null,{"$f":"Income!D18","v":0},{"$f":"Income!F18","v":"M"},0,null,null,null,null,null,null,null,{"$f":"Income!H18","v":false},{"$f":"IF(P25=TRUE,CONCATENATE(Income!$B$9,\" / \",Income!B18,\" / \",Income!J18),\"\")","v":""},null,{"$f":"IF(P25=TRUE,Income!J18,\"\")","v":""}]
[null,{"$f":"Income!A19","v":13},{"$f":"Income!B19","v":"Carer’s Allowance"},null,null,{"$f":"Income!D19","v":0},{"$f":"Income!F19","v":"M"},0,null,null,null,null,null,null,null,{"$f":"Income!H19","v":false},{"$f":"IF(P26=TRUE,CONCATENATE(Income!$B$9,\" / \",Income!B19,\" / \",Income!J19),\"\")","v":""},null,{"$f":"IF(P26=TRUE,Income!J19,\"\")","v":""}]
[null,{"$f":"Income!A20","v":14},{"$f":"Income!B20","v":"Local Housing Allowance / Housing Benefit"},null,null,{"$f":"Income!D20","v":0},{"$f":"Income!F20","v":"M"},0,null,null,null,null,null,null,null,{"$f":"Income!H20","v":false},{"$f":"IF(P27=TRUE,CONCATENATE(Income!$B$9,\" / \",Income!B20,\" / \",Income!J20),\"\")","v":""},null,{"$f":"IF(P27=TRUE,Income!J20,\"\")","v":""}]
[null,{"$f":"Income!A21","v":15},{"$f":"Income!B21","v":"Council Tax support"},null,null,{"$f":"Income!D21","v":0},{"$f":"Income!F21","v":"M"},0,null,null,null,null,null,null,null,{"$f":"Income!H21","v":false},{"$f":"IF(P28=TRUE,CONCATENATE(Income!$B$9,\" / \",Income!B21,\" / \",Income!J21),\"\")","v":""},null,{"$f":"IF(P28=TRUE,Income!J21,\"\")","v":""}]
[null,{"$f":"Income!A22","v":16},{"$f":"Income!B22","v":"Other benefits/tax credits (e.g. maternity benefits)"},null,null,{"$f":"Income!D22","v":0},{"$f":"Income!F22","v":"M"},0,null,null,null,null,null,null,null,{"$f":"Income!H22","v":false},{"$f":"IF(P29=TRUE,CONCATENATE(Income!$B$9,\" / \",Income!B22,\" / \",Income!J22),\"\")","v":""},null,{"$f":"IF(P29=TRUE,Income!J22,\"\")","v":""}]
[null,null,{"$f":"Income!B23","v":"Total benefits and tax credits per month"},null,null,null,null,{"$f":"SUM(H17:H29)","v":0},null,null,null,null,null,null,null,{"$f":"IF(P16=TRUE,TRUE,FALSE)","v":false},"\"",null,{"$f":"Q30","v":"\""}]
[]
[null,{"$f":"\"Monthly Income - \"&Income!B25","v":"Monthly Income - Pensions"},null,null,null,"£ Amount",null,"£ Monthly",null,null,null,null,null,null,null,{"$f":"IF(Q32=\"\",FALSE,TRUE)","v":false},{"$f":"IF(P33=TRUE,B32,IF(P34=TRUE,B32,IF(P35=TRUE,B32,IF(P36=TRUE,B32,\"\"))))","v":""},null,{"$f":"IF(P33=TRUE,Q32,IF(P34=TRUE,Q32,IF(P35=TRUE,Q32,IF(P36=TRUE,Q32,\"\"))))","v":""}]
[null,{"$f":"Income!A26","v":17},{"$f":"Income!B26","v":"State pensions"},null,null,{"$f":"Income!D26","v":0},{"$f":"Income!F26","v":"M"},{"$f":"IF(G33=\"W\",F33*52/12,IF(OR(G33=\"M\",LEN(G33)=0),F33,IF(G33=\"Q\",F33/3,IF(G33=\"F\",F33*26/12,IF(OR(G33=\"A\",G33=\"Y\"),F33/12,F33)))))","v":0},null,null,null,null,null,null,null,{"$f":"Income!H26","v":false},{"$f":"IF(P33=TRUE,CONCATENATE(Income!$B$25,\" / \",Income!B26,\" / \",Income!J26),\"\")","v":""},null,{"$f":"IF(P33=TRUE,Income!J26,\"\")","v":""}]
[null,{"$f":"Income!A27","v":18},{"$f":"Income!B27","v":"Private or work pensions"},null,null,{"$f":"Income!D27","v":0},{"$f":"Income!F27","v":"M"},{"$f":"IF(G34=\"W\",F34*52/12,IF(OR(G34=\"M\",LEN(G34)=0),F34,IF(G34=\"Q\",F34/3,IF(G34=\"F\",F34*26/12,IF(OR(G34=\"A\",G34=\"Y\"),F34/12,F34)))))","v":0},null,null,null,null,null,null,null,{"$f":"Income!H27","v":false},{"$f":"IF(P34=TRUE,CONCATENATE(Income!$B$25,\" / \",Income!B27,\" / \",Income!J27),\"\")","v":""},null,{"$f":"IF(P34=TRUE,Income!J27,\"\")","v":""}]
[null,{"$f":"Income!A28","v":19},{"$f":"Income!B28","v":"Pension credit"},null,null,{"$f":"Income!D28","v":0},{"$f":"Income!F28","v":"M"},{"$f":"IF(G35=\"W\",F35*52/12,IF(OR(G35=\"M\",LEN(G35)=0),F35,IF(G35=\"Q\",F35/3,IF(G35=\"F\",F35*26/12,IF(OR(G35=\"A\",G35=\"Y\"),F35/12,F35)))))","v":0},null,null,null,null,null,null,null,{"$f":"Income!H28","v":false},{"$f":"IF(P35=TRUE,CONCATENATE(Income!$B$25,\" / \",Income!B28,\" / \",Income!J28),\"\")","v":""},null,{"$f":"IF(P35=TRUE,Income!J28,\"\")","v":""}]
[null,{"$f":"Income!A29","v":20},{"$f":"Income!B29","v":"Other pensions"},null,null,{"$f":"Income!D29","v":0},{"$f":"Income!F29","v":"M"},{"$f":"IF(G36=\"W\",F36*52/12,IF(OR(G36=\"M\",LEN(G36)=0),F36,IF(G36=\"Q\",F36/3,IF(G36=\"F\",F36*26/12,IF(OR(G36=\"A\",G36=\"Y\"),F36/12,F36)))))","v":0},null,null,null,null,null,null,null,{"$f":"Income!H29","v":false},{"$f":"IF(P36=TRUE,CONCATENATE(Income!$B$25,\" / \",Income!B29,\" / \",Income!J29),\"\")","v":""},null,{"$f":"IF(P36=TRUE,Income!J29,\"\")","v":""}]
[null,null,null,null,null,null,null,null,null,null,null,null,null,null,null,{"$f":"IF(P32=TRUE,TRUE,FALSE)","v":false},"\"",null,{"$f":"Q37","v":"\""}]
[null,null,{"$f":"Income!B30","v":"Total pensions per month"},null,null,null,null,{"$f":"SUM(H33:H37)","v":0}]
[]
[null,{"$f":"\"Monthly Income - \"&Income!B32","v":"Monthly Income - Other income "},null,null,null,"£ Amount",null,"£ Monthly",null,null,null,null,null,null,null,{"$f":"IF(Q40=\"\",FALSE,TRUE)","v":false},{"$f":"IF(P41=TRUE,B40,IF(P42=TRUE,B40,IF(P43=TRUE,B40,IF(P44=TRUE,B40,IF(P45=TRUE,B40,\"\")))))","v":""},null,{"$f":"IF(P41=TRUE,Q40,IF(P42=TRUE,Q40,IF(P43=TRUE,Q40,IF(P44=TRUE,Q40,IF(P45=TRUE,Q40,\"\")))))","v":""}]
[null,{"$f":"Income!A33","v":21},{"$f":"Income!B33","v":"Maintenance or child support"},null,null,{"$f":"Income!D33","v":0},{"$f":"Income!F33","v":"M"},{"$f":"IF(G41=\"W\",F41*52/12,IF(OR(G41=\"M\",LEN(G41)=0),F41,IF(G41=\"Q\",F41/3,IF(G41=\"F\",F41*26/12,IF(OR(G41=\"A\",G41=\"Y\"),F41/12,F41)))))","v":0},null,null,null,null,null,null,null,{"$f":"Income!H33","v":false},{"$f":"IF(P41=TRUE,CONCATENATE(Income!$B$32,\" / \",Income!B33,\" / \",Income!J33),\"\")","v":""},null,{"$f":"IF(P41=TRUE,Income!J33,\"\")","v":""}]
[null,{"$f":"Income!A34","v":22},{"$f":"Income!B34","v":"Boarders or lodgers"},null,null,{"$f":"Income!D34","v":0},{"$f":"Income!F34","v":"M"},{"$f":"IF(G42=\"W\",F42*52/12,IF(OR(G42=\"M\",LEN(G42)=0),F42,IF(G42=\"Q\",F42/3,IF(G42=\"F\",F42*26/12,IF(OR(G42=\"A\",G42=\"Y\"),F42/12,F42)))))","v":0},null,null,null,null,null,null,null,{"$f":"Income!H34","v":false},{"$f":"IF(P42=TRUE,CONCATENATE(Income!$B$32,\" / \",Income!B34,\" / \",Income!J34),\"\")","v":""},null,{"$f":"IF(P42=TRUE,Income!J34,\"\")","v":""}]
[null,{"$f":"Income!A35","v":23},{"$f":"Income!B35","v":"Non-dependants’ contributions"},null,null,{"$f":"Income!D35","v":0},{"$f":"Income!F35","v":"M"},{"$f":"IF(G43=\"W\",F43*52/12,IF(OR(G43=\"M\",LEN(G43)=0),F43,IF(G43=\"Q\",F43/3,IF(G43=\"F\",F43*26/12,IF(OR(G43=\"A\",G43=\"Y\"),F43/12,F43)))))","v":0},null,null,null,null,null,null,null,{"$f":"Income!H35","v":false},{"$f":"IF(P43=TRUE,CONCATENATE(Income!$B$32,\" / \",Income!B35,\" / \",Income!J35),\"\")","v":""},null,{"$f":"IF(P43=TRUE,Income!J35,\"\")","v":""}]
[null,{"$f":"Income!A36","v":24},{"$f":"Income!B36","v":"Student loans and grants"},null,null,{"$f":"Income!D36","v":0},{"$f":"Income!F36","v":"M"},{"$f":"IF(G44=\"W\",F44*52/12,IF(OR(G44=\"M\",LEN(G44)=0),F44,IF(G44=\"Q\",F44/3,IF(G44=\"F\",F44*26/12,IF(OR(G44=\"A\",G44=\"Y\"),F44/12,F44)))))","v":0},null,null,null,null,null,null,null,{"$f":"Income!H36","v":false},{"$f":"IF(P44=TRUE,CONCATENATE(Income!$B$32,\" / \",Income!B36,\" / \",Income!J36),\"\")","v":""},null,{"$f":"IF(P44=TRUE,Income!J36,\"\")","v":""}]
[null,{"$f":"Income!A37","v":25},{"$f":"Income!B37","v":"Other income"},null,null,{"$f":"Income!D37","v":0},{"$f":"Income!F37","v":"M"},{"$f":"IF(G45=\"W\",F45*52/12,IF(OR(G45=\"M\",LEN(G45)=0),F45,IF(G45=\"Q\",F45/3,IF(G45=\"F\",F45*26/12,IF(OR(G45=\"A\",G45=\"Y\"),F45/12,F45)))))","v":0},null,null,null,null,null,null,null,{"$f":"Income!H37","v":false},{"$f":"IF(P45=TRUE,CONCATENATE(Income!$B$32,\" / \",Income!B37,\" / \",Income!J37),\"\")","v":""},null,{"$f":"IF(P45=TRUE,Income!J37,\"\")","v":""}]
[null,null,null,null,null,null,null,null,null,null,null,null,null,null,null,{"$f":"IF(P40=TRUE,TRUE,FALSE)","v":false},"\"",null,{"$f":"Q46","v":"\""}]
[null,null,{"$f":"Income!B38","v":"Total other income per month"},null,null,null,null,{"$f":"SUM(H41:H46)","v":0}]
[null,null,"Monthly Total Income",null,null,null,null,{"$f":"H14 + H30 + H38 + H47","v":0}]
[]
[]
[null,{"$f":"\"Monthly Outgoings Fixed - \" &'Outgoings - Fixed'!B3","v":"Monthly Outgoings Fixed - Home and contents "},null,null,null,"£ Amount",null,"£ Monthly",null,null,null,null,null,null,null,{"$f":"IF(Q51=\"\",FALSE,TRUE)","v":false},{"$f":"IF(COUNTIF(P52:P60,TRUE)>0,B51,\"\")","v":""},null,{"$f":"IF(COUNTIF(P52:P60,TRUE)>0,Q51,\"\")","v":""}]
[null,{"$f":"'Outgoings - Fixed'!A4","v":26},{"$f":"'Outgoings - Fixed'!B4","v":"Rent"},null,null,{"$f":"'Outgoings - Fixed'!D4","v":0},{"$f":"'Outgoings - Fixed'!F4","v":"M"},{"$f":"IF(G52=\"W\",F52*52/12,IF(OR(G52=\"M\",LEN(G52)=0),F52,IF(G52=\"Q\",F52/3,IF(G52=\"F\",F52*26/12,IF(OR(G52=\"A\",G52=\"Y\"),F52/12,F52)))))","v":0},null,null,null,null,null,null,null,{"$f":"'Outgoings - Fixed'!H4","v":false},{"$f":"IF(P52=TRUE,CONCATENATE('Outgoings - Fixed'!$B$3,\" / \",'Outgoings - Fixed'!B4,\" / \",'Outgoings - Fixed'!J4),\"\")","v":""},null,{"$f":"IF(P52=TRUE,'Outgoings - Fixed'!J4,\"\")","v":""}]
[null,{"$f":"'Outgoings - Fixed'!A5","v":27},{"$f":"'Outgoings - Fixed'!B5","v":"Ground rent & service charges  \n(factor fees if you live in Scotland)"},null,null,{"$f":"'Outgoings - Fixed'!D5","v":0},{"$f":"'Outgoings - Fixed'!F5","v":"M"},0,null,null,null,null,null,null,null,{"$f":"'Outgoings - Fixed'!H5","v":false},{"$f":"IF(P53=TRUE,CONCATENATE('Outgoings - Fixed'!$B$3,\" / \",'Outgoings - Fixed'!B5,\" / \",'Outgoings - Fixed'!J5),\"\")","v":""},null,{"$f":"IF(P53=TRUE,'Outgoings - Fixed'!J5,\"\")","v":""}]
[null,{"$f":"'Outgoings - Fixed'!A6","v":28},{"$f":"'Outgoings - Fixed'!B6","v":"Mortgage"},null,null,{"$f":"'Outgoings - Fixed'!D6","v":0},{"$f":"'Outgoings - Fixed'!F6","v":"M"},0,null,null,null,null,null,null,null,{"$f":"'Outgoings - Fixed'!H6","v":false},{"$f":"IF(P54=TRUE,CONCATENATE('Outgoings - Fixed'!$B$3,\" / \",'Outgoings - Fixed'!B6,\" / \",'Outgoings - Fixed'!J6),\"\")","v":""},null,{"$f":"IF(P54=TRUE,'Outgoings - Fixed'!J6,\"\")","v":""}]
[null,{"$f":"'Outgoings - Fixed'!A7","v":29},{"$f":"'Outgoings - Fixed'!B7","v":"Mortgage endowment"},null,null,{"$f":"'Outgoings - Fixed'!D7","v":0},{"$f":"'Outgoings - Fixed'!F7","v":"M"},0,null,null,null,null,null,null,null,{"$f":"'Outgoings - Fixed'!H7","v":false},{"$f":"IF(P55=TRUE,CONCATENATE('Outgoings - Fixed'!$B$3,\" / \",'Outgoings - Fixed'!B7,\" / \",'Outgoings - Fixed'!J7),\"\")","v":""},null,{"$f":"IF(P55=TRUE,'Outgoings - Fixed'!J7,\"\")","v":""}]
[null,{"$f":"'Outgoings - Fixed'!A8","v":30},{"$f":"'Outgoings - Fixed'!B8","v":"Secured loans"},null,null,{"$f":"'Outgoings - Fixed'!D8","v":0},{"$f":"'Outgoings - Fixed'!F8","v":"M"},0,null,null,null,null,null,null,null,{"$f":"'Outgoings - Fixed'!H8","v":false},{"$f":"IF(P56=TRUE,CONCATENATE('Outgoings - Fixed'!$B$3,\" / \",'Outgoings - Fixed'!B8,\" / \",'Outgoings - Fixed'!J8),\"\")","v":""},null,{"$f":"IF(P56=TRUE,'Outgoings - Fixed'!J8,\"\")","v":""}]
[null,{"$f":"'Outgoings - Fixed'!A9","v":31},{"$f":"'Outgoings - Fixed'!B9","v":"Council tax/rates (including water charge if you \nlive in Scotland and rates in NI)"},null,null,{"$f":"'Outgoings - Fixed'!D9","v":0},{"$f":"'Outgoings - Fixed'!F9","v":"M"},0,null,null,null,null,null,null,null,{"$f":"'Outgoings - Fixed'!H9","v":false},{"$f":"IF(P57=TRUE,CONCATENATE('Outgoings - Fixed'!$B$3,\" / \",'Outgoings - Fixed'!B9,\" / \",'Outgoings - Fixed'!J9),\"\")","v":""},null,{"$f":"IF(P57=TRUE,'Outgoings - Fixed'!J9,\"\")","v":""}]
[null,{"$f":"'Outgoings - Fixed'!A10","v":32},{"$f":"'Outgoings - Fixed'!B10","v":"Appliance & furniture rental (including appliance \nand furniture HP, conditional sale and so on)"},null,null,{"$f":"'Outgoings - Fixed'!D10","v":0},{"$f":"'Outgoings - Fixed'!F10","v":"M"},0,null,null,null,null,null,null,null,{"$f":"'Outgoings - Fixed'!H10","v":false},{"$f":"IF(P58=TRUE,CONCATENATE('Outgoings - Fixed'!$B$3,\" / \",'Outgoings - Fixed'!B10,\" / \",'Outgoings - Fixed'!J10),\"\")","v":""},null,{"$f":"IF(P58=TRUE,'Outgoings - Fixed'!J10,\"\")","v":""}]
[null,{"$f":"'Outgoings - Fixed'!A11","v":33},{"$f":"'Outgoings - Fixed'!B11","v":"TV licence"},null,null,{"$f":"'Outgoings - Fixed'!D11","v":0},{"$f":"'Outgoings - Fixed'!F11","v":"M"},0,null,null,null,null,null,null,null,{"$f":"'Outgoings - Fixed'!H11","v":false},{"$f":"IF(P59=TRUE,CONCATENATE('Outgoings - Fixed'!$B$3,\" / \",'Outgoings - Fixed'!B11,\" / \",'Outgoings - Fixed'!J11),\"\")","v":""},null,{"$f":"IF(P59=TRUE,'Outgoings - Fixed'!J11,\"\")","v":""}]
[null,{"$f":"'Outgoings - Fixed'!A12","v":34},{"$f":"'Outgoings - Fixed'!B12","v":"Other costs"},null,null,{"$f":"'Outgoings - Fixed'!D12","v":0},{"$f":"'Outgoings - Fixed'!F12","v":"M"},{"$f":"IF(G60=\"W\",F60*52/12,IF(OR(G60=\"M\",LEN(G60)=0),F60,IF(G60=\"Q\",F60/3,IF(G60=\"F\",F60*26/12,IF(OR(G60=\"A\",G60=\"Y\"),F60/12,F60)))))","v":0},null,null,null,null,null,null,null,{"$f":"'Outgoings - Fixed'!H12","v":false},{"$f":"IF(P60=TRUE,CONCATENATE('Outgoings - Fixed'!$B$3,\" / \",'Outgoings - Fixed'!B12,\" / \",'Outgoings - Fixed'!J12),\"\")","v":""},null,{"$f":"IF(P60=TRUE,'Outgoings - Fixed'!J12,\"\")","v":""}]
[null,null,{"$f":"'Outgoings - Fixed'!B13","v":"Total home & contents costs per month"},null,null,null,null,{"$f":"SUM(H52:H60)","v":0},null,null,null,null,null,null,null,{"$f":"IF(P51=TRUE,TRUE,FALSE)","v":false},"\"",null,{"$f":"Q61","v":"\""}]
[]
[null,{"$f":"\"Monthly Outgoings Fixed - \" &'Outgoings - Fixed'!B15","v":"Monthly Outgoings Fixed - Utilities "},null,null,null,"£ Amount",null,"£ Monthly",null,null,null,null,null,null,null,{"$f":"IF(Q63=\"\",FALSE,TRUE)","v":false},{"$f":"IF(COUNTIF(P64:P67,TRUE)>0,B63,\"\")","v":""},null,{"$f":"IF(COUNTIF(P64:P67,TRUE)>0,Q63,\"\")","v":""}]
[null,{"$f":"'Outgoings - Fixed'!A16","v":35},{"$f":"'Outgoings - Fixed'!B16","v":"Gas"},null,null,{"$f":"'Outgoings - Fixed'!D16","v":0},{"$f":"'Outgoings - Fixed'!F16","v":"M"},{"$f":"IF(G64=\"W\",F64*52/12,IF(OR(G64=\"M\",LEN(G64)=0),F64,IF(G64=\"Q\",F64/3,IF(G64=\"F\",F64*26/12,IF(OR(G64=\"A\",G64=\"Y\"),F64/12,F64)))))","v":0},null,null,null,null,null,null,null,{"$f":"'Outgoings - Fixed'!H16","v":false},{"$f":"IF(P64=TRUE,CONCATENATE('Outgoings - Fixed'!$B$15,\" / \",'Outgoings - Fixed'!B16,\" / \",'Outgoings - Fixed'!J16),\"\")","v":""},null,{"$f":"IF(P64=TRUE,'Outgoings - Fixed'!J16,\"\")","v":""}]
[null,{"$f":"'Outgoings - Fixed'!A17","v":36},{"$f":"'Outgoings - Fixed'!B17","v":"Electricity"},null,null,{"$f":"'Outgoings - Fixed'!D17","v":0},{"$f":"'Outgoings - Fixed'!F17","v":"M"},{"$f":"IF(G65=\"W\",F65*52/12,IF(OR(G65=\"M\",LEN(G65)=0),F65,IF(G65=\"Q\",F65/3,IF(G65=\"F\",F65*26/12,IF(OR(G65=\"A\",G65=\"Y\"),F65/12,F65)))))","v":0},null,null,null,null,null,null,null,{"$f":"'Outgoings - Fixed'!H17","v":false},{"$f":"IF(P65=TRUE,CONCATENATE('Outgoings - Fixed'!$B$15,\" / \",'Outgoings - Fixed'!B17,\" / \",'Outgoings - Fixed'!J17),\"\")","v":""},null,{"$f":"IF(P65=TRUE,'Outgoings - Fixed'!J17,\"\")","v":""}]
[null,{"$f":"'Outgoings - Fixed'!A18","v":37},{"$f":"'Outgoings - Fixed'!B18","v":"Other costs (including coal, oil, calor gas etc.)"},null,null,{"$f":"'Outgoings - Fixed'!D18","v":0},{"$f":"'Outgoings - Fixed'!F18","v":"M"},{"$f":"IF(G66=\"W\",F66*52/12,IF(OR(G66=\"M\",LEN(G66)=0),F66,IF(G66=\"Q\",F66/3,IF(G66=\"F\",F66*26/12,IF(OR(G66=\"A\",G66=\"Y\"),F66/12,F66)))))","v":0},null,null,null,null,null,null,null,{"$f":"'Outgoings - Fixed'!H18","v":false},{"$f":"IF(P66=TRUE,CONCATENATE('Outgoings - Fixed'!$B$15,\" / \",'Outgoings - Fixed'!B18,\" / \",'Outgoings - Fixed'!J18),\"\")","v":""},null,{"$f":"IF(P66=TRUE,'Outgoings - Fixed'!J18,\"\")","v":""}]
[null,{"$f":"'Outgoings - Fixed'!A19","v":38},{"$f":"'Outgoings - Fixed'!B19","v":"Other expenditure"},null,null,{"$f":"'Outgoings - Fixed'!D19","v":0},{"$f":"'Outgoings - Fixed'!F19","v":"M"},{"$f":"IF(G67=\"W\",F67*52/12,IF(OR(G67=\"M\",LEN(G67)=0),F67,IF(G67=\"Q\",F67/3,IF(G67=\"F\",F67*26/12,IF(OR(G67=\"A\",G67=\"Y\"),F67/12,F67)))))","v":0},null,null,null,null,null,null,null,{"$f":"'Outgoings - Fixed'!H19","v":false},{"$f":"IF(P67=TRUE,CONCATENATE('Outgoings - Fixed'!$B$15,\" / \",'Outgoings - Fixed'!B19,\" / \",'Outgoings - Fixed'!J19),\"\")","v":""},null,{"$f":"IF(P67=TRUE,'Outgoings - Fixed'!J19,\"\")","v":""}]
[null,null,null,null,null,null,null,null,null,null,null,null,null,null,null,{"$f":"IF(P63=TRUE,TRUE,FALSE)","v":false},"\"",null,{"$f":"Q68","v":"\""}]
[null,null,{"$f":"'Outgoings - Fixed'!B20","v":"Total utilities costs per month"},null,null,null,null,{"$f":"SUM(H64:H68)","v":0}]
[]
[null,{"$f":"\"Monthly Outgoings Fixed - \" &'Outgoings - Fixed'!B23","v":"Monthly Outgoings Fixed - Water supply"},null,null,null,"£ Amount",null,"£ Monthly",null,null,null,null,null,null,null,{"$f":"IF(Q71=\"\",FALSE,TRUE)","v":false},{"$f":"IF(COUNTIF(P72:P73,TRUE)>0,B71,\"\")","v":""},null,{"$f":"IF(COUNTIF(P72:P73,TRUE)>0,Q71,\"\")","v":""}]
[null,{"$f":"'Outgoings - Fixed'!A23","v":39},{"$f":"'Outgoings - Fixed'!B23","v":"Water supply"},null,null,{"$f":"'Outgoings - Fixed'!D23","v":0},{"$f":"'Outgoings - Fixed'!F23","v":"M"},{"$f":"IF(G72=\"W\",F72*52/12,IF(OR(G72=\"M\",LEN(G72)=0),F72,IF(G72=\"Q\",F72/3,IF(G72=\"F\",F72*26/12,IF(OR(G72=\"A\",G72=\"Y\"),F72/12,F72)))))","v":0},null,null,null,null,null,null,null,{"$f":"'Outgoings - Fixed'!H23","v":false},{"$f":"IF(P72=TRUE,CONCATENATE('Outgoings - Fixed'!$B$22,\" / \",'Outgoings - Fixed'!B23,\" / \",'Outgoings - Fixed'!J23),\"\")","v":""},null,{"$f":"IF(P72=TRUE,'Outgoings - Fixed'!J23,\"\")","v":""}]
[null,{"$f":"'Outgoings - Fixed'!A24","v":40},{"$f":"'Outgoings - Fixed'!B24","v":"Water waste"},null,null,{"$f":"'Outgoings - Fixed'!D24","v":0},{"$f":"'Outgoings - Fixed'!F24","v":"M"},{"$f":"IF(G73=\"W\",F73*52/12,IF(OR(G73=\"M\",LEN(G73)=0),F73,IF(G73=\"Q\",F73/3,IF(G73=\"F\",F73*26/12,IF(OR(G73=\"A\",G73=\"Y\"),F73/12,F73)))))","v":0},null,null,null,null,null,null,null,{"$f":"'Outgoings - Fixed'!H24","v":false},{"$f":"IF(P73=TRUE,CONCATENATE('Outgoings - Fixed'!$B$22,\" / \",'Outgoings - Fixed'!B24,\" / \",'Outgoings - Fixed'!J24),\"\")","v":""},null,{"$f":"IF(P73=TRUE,'Outgoings - Fixed'!J24,\"\")","v":""}]
[null,null,null,null,null,null,null,null,null,null,null,null,null,null,null,{"$f":"IF(P71=TRUE,TRUE,FALSE)","v":false},"\"",null,{"$f":"Q74","v":"\""}]
[null,null,{"$f":"'Outgoings - Fixed'!B25","v":"Total water costs per month"},null,null,null,null,{"$f":"SUM(H72:H74)","v":0}]
[]
[null,{"$f":"\"Monthly Outgoings Fixed - \" &'Outgoings - Fixed'!B27","v":"Monthly Outgoings Fixed - Care and health costs "},null,null,null,"£ Amount",null,"£ Monthly",null,null,null,null,null,null,null,{"$f":"IF(Q77=\"\",FALSE,TRUE)","v":false},{"$f":"IF(COUNTIF(P78:P83,TRUE)>0,B77,\"\")","v":""},null,{"$f":"IF(COUNTIF(P78:P83,TRUE)>0,Q77,\"\")","v":""}]
[null,{"$f":"'Outgoings - Fixed'!A28","v":41},{"$f":"'Outgoings - Fixed'!B28","v":"Childcare costs"},null,null,{"$f":"'Outgoings - Fixed'!D28","v":0},{"$f":"'Outgoings - Fixed'!F28","v":"M"},{"$f":"IF(G78=\"W\",F78*52/12,IF(OR(G78=\"M\",LEN(G78)=0),F78,IF(G78=\"Q\",F78/3,IF(G78=\"F\",F78*26/12,IF(OR(G78=\"A\",G78=\"Y\"),F78/12,F78)))))","v":0},null,null,null,null,null,null,null,{"$f":"'Outgoings - Fixed'!H28","v":false},{"$f":"IF(P78=TRUE,CONCATENATE('Outgoings - Fixed'!$B$27,\" / \",'Outgoings - Fixed'!B28,\" / \",'Outgoings - Fixed'!J28),\"\")","v":""},null,{"$f":"IF(P78=TRUE,'Outgoings - Fixed'!J28,\"\")","v":""}]
[null,{"$f":"'Outgoings - Fixed'!A29","v":42},{"$f":"'Outgoings - Fixed'!B29","v":"Adult-care costs"},null,null,{"$f":"'Outgoings - Fixed'!D29","v":0},{"$f":"'Outgoings - Fixed'!F29","v":"M"},0,null,null,null,null,null,null,null,{"$f":"'Outgoings - Fixed'!H29","v":false},{"$f":"IF(P79=TRUE,CONCATENATE('Outgoings - Fixed'!$B$27,\" / \",'Outgoings - Fixed'!B29,\" / \",'Outgoings - Fixed'!J29),\"\")","v":""},null,{"$f":"IF(P79=TRUE,'Outgoings - Fixed'!J29,\"\")","v":""}]
[null,{"$f":"'Outgoings - Fixed'!A30","v":43},{"$f":"'Outgoings - Fixed'!B30","v":"Child maintenance or child support"},null,null,{"$f":"'Outgoings - Fixed'!D30","v":0},{"$f":"'Outgoings - Fixed'!F30","v":"M"},0,null,null,null,null,null,null,null,{"$f":"'Outgoings - Fixed'!H30","v":false},{"$f":"IF(P80=TRUE,CONCATENATE('Outgoings - Fixed'!$B$27,\" / \",'Outgoings - Fixed'!B30,\" / \",'Outgoings - Fixed'!J30),\"\")","v":""},null,{"$f":"IF(P80=TRUE,'Outgoings - Fixed'!J30,\"\")","v":""}]
[null,{"$f":"'Outgoings - Fixed'!A31","v":44},{"$f":"'Outgoings - Fixed'!B31","v":"Prescriptions and medicines"},null,null,{"$f":"'Outgoings - Fixed'!D31","v":0},{"$f":"'Outgoings - Fixed'!F31","v":"M"},0,null,null,null,null,null,null,null,{"$f":"'Outgoings - Fixed'!H31","v":false},{"$f":"IF(P81=TRUE,CONCATENATE('Outgoings - Fixed'!$B$27,\" / \",'Outgoings - Fixed'!B31,\" / \",'Outgoings - Fixed'!J31),\"\")","v":""},null,{"$f":"IF(P81=TRUE,'Outgoings - Fixed'!J31,\"\")","v":""}]
[null,{"$f":"'Outgoings - Fixed'!A32","v":45},{"$f":"'Outgoings - Fixed'!B32","v":"Dentistry and opticians"},null,null,{"$f":"'Outgoings - Fixed'!D32","v":0},{"$f":"'Outgoings - Fixed'!F32","v":"M"},0,null,null,null,null,null,null,null,{"$f":"'Outgoings - Fixed'!H32","v":false},{"$f":"IF(P82=TRUE,CONCATENATE('Outgoings - Fixed'!$B$27,\" / \",'Outgoings - Fixed'!B32,\" / \",'Outgoings - Fixed'!J32),\"\")","v":""},null,{"$f":"IF(P82=TRUE,'Outgoings - Fixed'!J32,\"\")","v":""}]
[null,{"$f":"'Outgoings - Fixed'!A33","v":46},{"$f":"'Outgoings - Fixed'!B33","v":"Other costs"},null,null,{"$f":"'Outgoings - Fixed'!D33","v":0},{"$f":"'Outgoings - Fixed'!F33","v":"M"},0,null,null,null,null,null,null,null,{"$f":"'Outgoings - Fixed'!H33","v":false},{"$f":"IF(P83=TRUE,CONCATENATE('Outgoings - Fixed'!$B$27,\" / \",'Outgoings - Fixed'!B33,\" / \",'Outgoings - Fixed'!J33),\"\")","v":""},null,{"$f":"IF(P83=TRUE,'Outgoings - Fixed'!J33,\"\")","v":""}]
[null,null,null,null,null,null,null,null,null,null,null,null,null,null,null,{"$f":"IF(P77=TRUE,TRUE,FALSE)","v":false},"\"",null,{"$f":"Q84","v":"\""}]
[null,null,{"$f":"'Outgoings - Fixed'!B34","v":"Total care and health costs per month"},null,null,null,null,{"$f":"SUM(H78:H84)","v":0}]
[]
[null,{"$f":"\"Monthly Outgoings Fixed - \" &'Outgoings - Fixed'!B36","v":"Monthly Outgoings Fixed - Transport and travel"},null,null,null,"£ Amount",null,"£ Monthly",null,null,null,null,null,null,null,{"$f":"IF(Q87=\"\",FALSE,TRUE)","v":false},{"$f":"IF(COUNTIF(P88:P95,TRUE)>0,B87,\"\")","v":""},null,{"$f":"IF(COUNTIF(P88:P95,TRUE)>0,Q87,\"\")","v":""}]
[null,{"$f":"'Outgoings - Fixed'!A37","v":47},{"$f":"'Outgoings - Fixed'!B37","v":"Public transport (e.g. work, school, shopping)"},null,null,{"$f":"'Outgoings - Fixed'!D37","v":0},{"$f":"'Outgoings - Fixed'!F37","v":"M"},{"$f":"IF(G88=\"W\",F88*52/12,IF(OR(G88=\"M\",LEN(G88)=0),F88,IF(G88=\"Q\",F88/3,IF(G88=\"F\",F88*26/12,IF(OR(G88=\"A\",G88=\"Y\"),F88/12,F88)))))","v":0},null,null,null,null,null,null,null,{"$f":"'Outgoings - Fixed'!H37","v":false},{"$f":"IF(P88=TRUE,CONCATENATE('Outgoings - Fixed'!$B$36,\" / \",'Outgoings - Fixed'!B37,\" / \",'Outgoings - Fixed'!J37),\"\")","v":""},null,{"$f":"IF(P88=TRUE,'Outgoings - Fixed'!J37,\"\")","v":""}]
[null,{"$f":"'Outgoings - Fixed'!A38","v":48},{"$f":"'Outgoings - Fixed'!B38","v":"Hire Purchase or conditional sale vehicle"},null,null,{"$f":"'Outgoings - Fixed'!D38","v":0},{"$f":"'Outgoings - Fixed'!F38","v":"M"},0,null,null,null,null,null,null,null,{"$f":"'Outgoings - Fixed'!H38","v":false},{"$f":"IF(P89=TRUE,CONCATENATE('Outgoings - Fixed'!$B$36,\" / \",'Outgoings - Fixed'!B38,\" / \",'Outgoings - Fixed'!J38),\"\")","v":""},null,{"$f":"IF(P89=TRUE,'Outgoings - Fixed'!J38,\"\")","v":""}]
[null,{"$f":"'Outgoings - Fixed'!A39","v":49},{"$f":"'Outgoings - Fixed'!B39","v":"Car insurance"},null,null,{"$f":"'Outgoings - Fixed'!D39","v":0},{"$f":"'Outgoings - Fixed'!F39","v":"M"},0,null,null,null,null,null,null,null,{"$f":"'Outgoings - Fixed'!H39","v":false},{"$f":"IF(P90=TRUE,CONCATENATE('Outgoings - Fixed'!$B$36,\" / \",'Outgoings - Fixed'!B39,\" / \",'Outgoings - Fixed'!J39),\"\")","v":""},null,{"$f":"IF(P90=TRUE,'Outgoings - Fixed'!J39,\"\")","v":""}]
[null,{"$f":"'Outgoings - Fixed'!A40","v":50},{"$f":"'Outgoings - Fixed'!B40","v":"Road tax"},null,null,{"$f":"'Outgoings - Fixed'!D40","v":0},{"$f":"'Outgoings - Fixed'!F40","v":"M"},0,null,null,null,null,null,null,null,{"$f":"'Outgoings - Fixed'!H40","v":false},{"$f":"IF(P91=TRUE,CONCATENATE('Outgoings - Fixed'!$B$36,\" / \",'Outgoings - Fixed'!B40,\" / \",'Outgoings - Fixed'!J40),\"\")","v":""},null,{"$f":"IF(P91=TRUE,'Outgoings - Fixed'!J40,\"\")","v":""}]
[null,{"$f":"'Outgoings - Fixed'!A41","v":51},{"$f":"'Outgoings - Fixed'!B41","v":"MOT and ongoing maintenance"},null,null,{"$f":"'Outgoings - Fixed'!D41","v":0},{"$f":"'Outgoings - Fixed'!F41","v":"M"},0,null,null,null,null,null,null,null,{"$f":"'Outgoings - Fixed'!H41","v":false},{"$f":"IF(P92=TRUE,CONCATENATE('Outgoings - Fixed'!$B$36,\" / \",'Outgoings - Fixed'!B41,\" / \",'Outgoings - Fixed'!J41),\"\")","v":""},null,{"$f":"IF(P92=TRUE,'Outgoings - Fixed'!J41,\"\")","v":""}]
[null,{"$f":"'Outgoings - Fixed'!A42","v":52},{"$f":"'Outgoings - Fixed'!B42","v":"Breakdown cover"},null,null,{"$f":"'Outgoings - Fixed'!D42","v":0},{"$f":"'Outgoings - Fixed'!F42","v":"M"},0,null,null,null,null,null,null,null,{"$f":"'Outgoings - Fixed'!H42","v":false},{"$f":"IF(P93=TRUE,CONCATENATE('Outgoings - Fixed'!$B$36,\" / \",'Outgoings - Fixed'!B42,\" / \",'Outgoings - Fixed'!J42),\"\")","v":""},null,{"$f":"IF(P93=TRUE,'Outgoings - Fixed'!J42,\"\")","v":""}]
[null,{"$f":"'Outgoings - Fixed'!A43","v":53},{"$f":"'Outgoings - Fixed'!B43","v":"Fuel, parking and toll road charges"},null,null,{"$f":"'Outgoings - Fixed'!D43","v":0},{"$f":"'Outgoings - Fixed'!F43","v":"M"},0,null,null,null,null,null,null,null,{"$f":"'Outgoings - Fixed'!H43","v":false},{"$f":"IF(P94=TRUE,CONCATENATE('Outgoings - Fixed'!$B$36,\" / \",'Outgoings - Fixed'!B43,\" / \",'Outgoings - Fixed'!J43),\"\")","v":""},null,{"$f":"IF(P94=TRUE,'Outgoings - Fixed'!J43,\"\")","v":""}]
[null,{"$f":"'Outgoings - Fixed'!A44","v":54},{"$f":"'Outgoings - Fixed'!B44","v":"Other costs (including taxis)"},null,null,{"$f":"'Outgoings - Fixed'!D44","v":0},{"$f":"'Outgoings - Fixed'!F44","v":"M"},{"$f":"IF(G95=\"W\",F95*52/12,IF(OR(G95=\"M\",LEN(G95)=0),F95,IF(G95=\"Q\",F95/3,IF(G95=\"F\",F95*26/12,IF(OR(G95=\"A\",G95=\"Y\"),F95/12,F95)))))","v":0},null,null,null,null,null,null,null,{"$f":"'Outgoings - Fixed'!H44","v":false},{"$f":"IF(P95=TRUE,CONCATENATE('Outgoings - Fixed'!$B$36,\" / \",'Outgoings - Fixed'!B44,\" / \",'Outgoings - Fixed'!J44),\"\")","v":""},null,{"$f":"IF(P95=TRUE,'Outgoings - Fixed'!J44,\"\")","v":""}]
[null,null,null,null,null,null,null,null,null,null,null,null,null,null,null,{"$f":"IF(P87=TRUE,TRUE,FALSE)","v":false},"\"",null,{"$f":"Q96","v":"\""}]
[null,null,{"$f":"'Outgoings - Fixed'!B45","v":"Total transport and travel costs per month"},null,null,null,null,{"$f":"SUM(H88:H96)","v":0}]
[]
[null,{"$f":"\"Monthly Outgoings Fixed - \" &'Outgoings - Fixed'!B47","v":"Monthly Outgoings Fixed - School costs"},null,null,null,"£ Amount",null,"£ Monthly",null,null,null,null,null,null,null,{"$f":"IF(Q99=\"\",FALSE,TRUE)","v":false},{"$f":"IF(COUNTIF(P100:P102,TRUE)>0,B99,\"\")","v":""},null,{"$f":"IF(COUNTIF(P100:P102,TRUE)>0,Q99,\"\")","v":""}]
[null,{"$f":"'Outgoings - Fixed'!A48","v":55},{"$f":"'Outgoings - Fixed'!B48","v":"School uniform"},null,null,{"$f":"'Outgoings - Fixed'!D48","v":0},{"$f":"'Outgoings - Fixed'!F48","v":"M"},{"$f":"IF(G100=\"W\",F100*52/12,IF(OR(G100=\"M\",LEN(G100)=0),F100,IF(G100=\"Q\",F100/3,IF(G100=\"F\",F100*26/12,IF(OR(G100=\"A\",G100=\"Y\"),F100/12,F100)))))","v":0},null,null,null,null,null,null,null,{"$f":"VLOOKUP(Conversions!B100,'Outgoings - Fixed'!$A$4:$H$58,8,FALSE)","v":false},{"$f":"IF(P100=TRUE,CONCATENATE('Outgoings - Fixed'!$B$47,\" / \",'Outgoings - Fixed'!B48,\" / \",'Outgoings - Fixed'!J48),\"\")","v":""},null,{"$f":"IF(P100=TRUE,'Outgoings - Fixed'!J48,\"\")","v":""}]
[null,{"$f":"'Outgoings - Fixed'!A49","v":56},{"$f":"'Outgoings - Fixed'!B49","v":"After-school clubs and school trips"},null,null,{"$f":"'Outgoings - Fixed'!D49","v":0},{"$f":"'Outgoings - Fixed'!F49","v":"M"},{"$f":"IF(G101=\"W\",F101*52/12,IF(OR(G101=\"M\",LEN(G101)=0),F101,IF(G101=\"Q\",F101/3,IF(G101=\"F\",F101*26/12,IF(OR(G101=\"A\",G101=\"Y\"),F101/12,F101)))))","v":0},null,null,null,null,null,null,null,{"$f":"VLOOKUP(Conversions!B101,'Outgoings - Fixed'!$A$4:$H$58,8,FALSE)","v":false},{"$f":"IF(P101=TRUE,CONCATENATE('Outgoings - Fixed'!$B$47,\" / \",'Outgoings - Fixed'!B49,\" / \",'Outgoings - Fixed'!J49),\"\")","v":""},null,{"$f":"IF(P101=TRUE,'Outgoings - Fixed'!J49,\"\")","v":""}]
[null,{"$f":"'Outgoings - Fixed'!A50","v":57},{"$f":"'Outgoings - Fixed'!B50","v":"Other costs"},null,null,{"$f":"'Outgoings - Fixed'!D50","v":0},{"$f":"'Outgoings - Fixed'!F50","v":"M"},{"$f":"IF(G102=\"W\",F102*52/12,IF(OR(G102=\"M\",LEN(G102)=0),F102,IF(G102=\"Q\",F102/3,IF(G102=\"F\",F102*26/12,IF(OR(G102=\"A\",G102=\"Y\"),F102/12,F102)))))","v":0},null,null,null,null,null,null,null,{"$f":"VLOOKUP(Conversions!B102,'Outgoings - Fixed'!$A$4:$H$58,8,FALSE)","v":false},{"$f":"IF(P102=TRUE,CONCATENATE('Outgoings - Fixed'!$B$47,\" / \",'Outgoings - Fixed'!B50,\" / \",'Outgoings - Fixed'!J50),\"\")","v":""},null,{"$f":"IF(P102=TRUE,'Outgoings - Fixed'!J50,\"\")","v":""}]
[null,null,null,null,null,null,null,null,null,null,null,null,null,null,null,{"$f":"IF(P99=TRUE,TRUE,FALSE)","v":false},"\"",null,{"$f":"Q103","v":"\""}]
[null,null,{"$f":"'Outgoings - Fixed'!B51","v":"Total school costs per month"},null,null,null,null,{"$f":"SUM(H100:H103)","v":0}]
[]
[null,{"$f":"\"Monthly Outgoings Fixed - \" &'Outgoings - Fixed'!B53","v":"Monthly Outgoings Fixed - Pensions and insurances "},null,null,null,"£ Amount",null,"£ Monthly",null,null,null,null,null,null,null,{"$f":"IF(Q106=\"\",FALSE,TRUE)","v":false},{"$f":"IF(COUNTIF(P107:P111,TRUE)>0,B106,\"\")","v":""},null,{"$f":"IF(COUNTIF(P107:P111,TRUE)>0,Q106,\"\")","v":""}]
[null,{"$f":"'Outgoings - Fixed'!A54","v":58},{"$f":"'Outgoings - Fixed'!B54","v":"Pension payments"},null,null,{"$f":"'Outgoings - Fixed'!D54","v":0},{"$f":"'Outgoings - Fixed'!F54","v":"M"},{"$f":"IF(G107=\"W\",F107*52/12,IF(OR(G107=\"M\",LEN(G107)=0),F107,IF(G107=\"Q\",F107/3,IF(G107=\"F\",F107*26/12,IF(OR(G107=\"A\",G107=\"Y\"),F107/12,F107)))))","v":0},null,null,null,null,null,null,null,{"$f":"VLOOKUP(Conversions!B107,'Outgoings - Fixed'!$A$4:$H$73,8,FALSE)","v":false},{"$f":"IF(P107=TRUE,CONCATENATE('Outgoings - Fixed'!$B$53,\" / \",'Outgoings - Fixed'!B54,\" / \",'Outgoings - Fixed'!J54),\"\")","v":""},null,{"$f":"IF(P107=TRUE,'Outgoings - Fixed'!J54,\"\")","v":""}]
[null,{"$f":"'Outgoings - Fixed'!A55","v":59},{"$f":"'Outgoings - Fixed'!B55","v":"Life insurance"},null,null,{"$f":"'Outgoings - Fixed'!D55","v":0},{"$f":"'Outgoings - Fixed'!F55","v":"M"},0,null,null,null,null,null,null,null,{"$f":"VLOOKUP(Conversions!B108,'Outgoings - Fixed'!$A$4:$H$73,8,FALSE)","v":false},{"$f":"IF(P108=TRUE,CONCATENATE('Outgoings - Fixed'!$B$53,\" / \",'Outgoings - Fixed'!B55,\" / \",'Outgoings - Fixed'!J55),\"\")","v":""},null,{"$f":"IF(P108=TRUE,'Outgoings - Fixed'!J55,\"\")","v":""}]
[null,{"$f":"'Outgoings - Fixed'!A56","v":60},{"$f":"'Outgoings - Fixed'!B56","v":"Mortgage payment protection insurance"},null,null,{"$f":"'Outgoings - Fixed'!D56","v":0},{"$f":"'Outgoings - Fixed'!F56","v":"M"},0,null,null,null,null,null,null,null,{"$f":"VLOOKUP(Conversions!B109,'Outgoings - Fixed'!$A$4:$H$73,8,FALSE)","v":false},{"$f":"IF(P109=TRUE,CONCATENATE('Outgoings - Fixed'!$B$53,\" / \",'Outgoings - Fixed'!B56,\" / \",'Outgoings - Fixed'!J56),\"\")","v":""},null,{"$f":"IF(P109=TRUE,'Outgoings - Fixed'!J56,\"\")","v":""}]
[null,{"$f":"'Outgoings - Fixed'!A57","v":61},{"$f":"'Outgoings - Fixed'!B57","v":"Buildings and contents insurance"},null,null,{"$f":"'Outgoings - Fixed'!D57","v":0},{"$f":"'Outgoings - Fixed'!F57","v":"M"},0,null,null,null,null,null,null,null,{"$f":"VLOOKUP(Conversions!B110,'Outgoings - Fixed'!$A$4:$H$73,8,FALSE)","v":false},{"$f":"IF(P110=TRUE,CONCATENATE('Outgoings - Fixed'!$B$53,\" / \",'Outgoings - Fixed'!B57,\" / \",'Outgoings - Fixed'!J57),\"\")","v":""},null,{"$f":"IF(P110=TRUE,'Outgoings - Fixed'!J57,\"\")","v":""}]
[null,{"$f":"'Outgoings - Fixed'!A58","v":62},{"$f":"'Outgoings - Fixed'!B58","v":"Health insurance (medical or accident or dental)"},null,null,{"$f":"'Outgoings - Fixed'!D58","v":0},{"$f":"'Outgoings - Fixed'!F58","v":"M"},0,null,null,null,null,null,null,null,{"$f":"VLOOKUP(Conversions!B111,'Outgoings - Fixed'!$A$4:$H$73,8,FALSE)","v":false},{"$f":"IF(P111=TRUE,CONCATENATE('Outgoings - Fixed'!$B$53,\" / \",'Outgoings - Fixed'!B58,\" / \",'Outgoings - Fixed'!J58),\"\")","v":""},null,{"$f":"IF(P111=TRUE,'Outgoings - Fixed'!J58,\"\")","v":""}]
[null,{"$f":"'Outgoings - Fixed'!A59","v":63},{"$f":"'Outgoings - Fixed'!B59","v":"Other costs"},null,null,{"$f":"'Outgoings - Fixed'!D59","v":0},{"$f":"'Outgoings - Fixed'!F59","v":"M"},0,null,null,null,null,null,null,null,{"$f":"VLOOKUP(Conversions!B112,'Outgoings - Fixed'!$A$4:$H$73,8,FALSE)","v":false},{"$f":"IF(P112=TRUE,CONCATENATE('Outgoings - Fixed'!$B$53,\" / \",'Outgoings - Fixed'!B59,\" / \",'Outgoings - Fixed'!J59),\"\")","v":""},null,{"$f":"IF(P112=TRUE,'Outgoings - Fixed'!J59,\"\")","v":""}]
[null,null,{"$f":"'Outgoings - Fixed'!B60","v":"Total pensions and insurance costs per month"},null,null,null,null,{"$f":"SUM(H107:H112)","v":0},null,null,null,null,null,null,null,{"$f":"IF(P106=TRUE,TRUE,FALSE)","v":false},"\"",null,{"$f":"Q113","v":"\""}]
[]
[null,{"$f":"\"Monthly Outgoings Fixed - \" &'Outgoings - Fixed'!B62","v":"Monthly Outgoings Fixed - Professional costs"},null,null,null,"£ Amount",null,"£ Monthly",null,null,null,null,null,null,null,{"$f":"IF(Q115=\"\",FALSE,TRUE)","v":false},{"$f":"IF(COUNTIF(P116:P119,TRUE)>0,B115,\"\")","v":""},null,{"$f":"IF(COUNTIF(P116:P119,TRUE)>0,Q115,\"\")","v":""}]
[null,{"$f":"'Outgoings - Fixed'!A63","v":64},{"$f":"'Outgoings - Fixed'!B63","v":"Professional courses"},null,null,{"$f":"'Outgoings - Fixed'!D63","v":0},{"$f":"'Outgoings - Fixed'!F63","v":"M"},{"$f":"IF(G116=\"W\",F116*52/12,IF(OR(G116=\"M\",LEN(G116)=0),F116,IF(G116=\"Q\",F116/3,IF(G116=\"F\",F116*26/12,IF(OR(G116=\"A\",G116=\"Y\"),F116/12,F116)))))","v":0},null,null,null,null,null,null,null,{"$f":"VLOOKUP(Conversions!B116,'Outgoings - Fixed'!$A$4:$H$73,8,FALSE)","v":false},{"$f":"IF(P116=TRUE,CONCATENATE('Outgoings - Fixed'!$B$62,\" / \",'Outgoings - Fixed'!B63,\" / \",'Outgoings - Fixed'!J63),\"\")","v":""},null,{"$f":"IF(P116=TRUE,'Outgoings - Fixed'!J63,\"\")","v":""}]
[null,{"$f":"'Outgoings - Fixed'!A64","v":65},{"$f":"'Outgoings - Fixed'!B64","v":"Union fees"},null,null,{"$f":"'Outgoings - Fixed'!D64","v":0},{"$f":"'Outgoings - Fixed'!F64","v":"M"},{"$f":"IF(G117=\"W\",F117*52/12,IF(OR(G117=\"M\",LEN(G117)=0),F117,IF(G117=\"Q\",F117/3,IF(G117=\"F\",F117*26/12,IF(OR(G117=\"A\",G117=\"Y\"),F117/12,F117)))))","v":0},null,null,null,null,null,null,null,{"$f":"VLOOKUP(Conversions!B117,'Outgoings - Fixed'!$A$4:$H$73,8,FALSE)","v":false},{"$f":"IF(P117=TRUE,CONCATENATE('Outgoings - Fixed'!$B$62,\" / \",'Outgoings - Fixed'!B64,\" / \",'Outgoings - Fixed'!J64),\"\")","v":""},null,{"$f":"IF(P117=TRUE,'Outgoings - Fixed'!J64,\"\")","v":""}]
[null,{"$f":"'Outgoings - Fixed'!A65","v":66},{"$f":"'Outgoings - Fixed'!B65","v":"Professional fees"},null,null,{"$f":"'Outgoings - Fixed'!D65","v":0},{"$f":"'Outgoings - Fixed'!F65","v":"M"},{"$f":"IF(G118=\"W\",F118*52/12,IF(OR(G118=\"M\",LEN(G118)=0),F118,IF(G118=\"Q\",F118/3,IF(G118=\"F\",F118*26/12,IF(OR(G118=\"A\",G118=\"Y\"),F118/12,F118)))))","v":0},null,null,null,null,null,null,null,{"$f":"VLOOKUP(Conversions!B118,'Outgoings - Fixed'!$A$4:$H$73,8,FALSE)","v":false},{"$f":"IF(P118=TRUE,CONCATENATE('Outgoings - Fixed'!$B$62,\" / \",'Outgoings - Fixed'!B65,\" / \",'Outgoings - Fixed'!J65),\"\")","v":""},null,{"$f":"IF(P118=TRUE,'Outgoings - Fixed'!J65,\"\")","v":""}]
[null,{"$f":"'Outgoings - Fixed'!A66","v":67},{"$f":"'Outgoings - Fixed'!B66","v":"Other"},null,null,{"$f":"'Outgoings - Fixed'!D66","v":0},{"$f":"'Outgoings - Fixed'!F66","v":"M"},{"$f":"IF(G119=\"W\",F119*52/12,IF(OR(G119=\"M\",LEN(G119)=0),F119,IF(G119=\"Q\",F119/3,IF(G119=\"F\",F119*26/12,IF(OR(G119=\"A\",G119=\"Y\"),F119/12,F119)))))","v":0},null,null,null,null,null,null,null,{"$f":"VLOOKUP(Conversions!B119,'Outgoings - Fixed'!$A$4:$H$73,8,FALSE)","v":false},{"$f":"IF(P119=TRUE,CONCATENATE('Outgoings - Fixed'!$B$62,\" / \",'Outgoings - Fixed'!B66,\" / \",'Outgoings - Fixed'!J66),\"\")","v":""},null,{"$f":"IF(P119=TRUE,'Outgoings - Fixed'!J66,\"\")","v":""}]
[null,null,{"$f":"'Outgoings - Fixed'!B67","v":"Total professional costs per month"},null,null,null,null,{"$f":"SUM(H116:H119)","v":0},null,null,null,null,null,null,null,{"$f":"IF(P115=TRUE,TRUE,FALSE)","v":false},"\"",null,{"$f":"Q120","v":"\""}]
[null,null,null,null,null,null,null,null,null,null,null,null,null,null,null,null,{"$f":"IF(P121=TRUE,CONCATENATE('Outgoings - Fixed'!$B$53,\" / \",'Outgoings - Fixed'!B69,\" / \",'Outgoings - Fixed'!J69),\"\")","v":""}]
[null,{"$f":"\"Monthly Outgoings Fixed - \" &'Outgoings - Fixed'!B69","v":"Monthly Outgoings Fixed - Other essential costs"},null,null,null,"£ Amount",null,"£ Monthly",null,null,null,null,null,null,null,{"$f":"IF(Q122=\"\",FALSE,TRUE)","v":false},{"$f":"IF(COUNTIF(P123:P126,TRUE)>0,B122,\"\")","v":""},null,{"$f":"IF(COUNTIF(P123:P126,TRUE)>0,Q122,\"\")","v":""}]
[null,{"$f":"'Outgoings - Fixed'!A70","v":68},{"$f":"'Outgoings - Fixed'!B70","v":0},null,null,{"$f":"'Outgoings - Fixed'!D70","v":0},{"$f":"'Outgoings - Fixed'!F70","v":"M"},{"$f":"IF(G123=\"W\",F123*52/12,IF(OR(G123=\"M\",LEN(G123)=0),F123,IF(G123=\"Q\",F123/3,IF(G123=\"F\",F123*26/12,IF(OR(G123=\"A\",G123=\"Y\"),F123/12,F123)))))","v":0},null,null,null,null,null,null,null,{"$f":"VLOOKUP(Conversions!B123,'Outgoings - Fixed'!$A$4:$H$73,8,FALSE)","v":false},{"$f":"IF(P123=TRUE,CONCATENATE('Outgoings - Fixed'!$B$69,\" / \",'Outgoings - Fixed'!B70,\" / \",'Outgoings - Fixed'!J70),\"\")","v":""},null,{"$f":"IF(P123=TRUE,'Outgoings - Fixed'!J70,\"\")","v":""}]
[null,{"$f":"'Outgoings - Fixed'!A71","v":69},{"$f":"IF('Outgoings - Fixed'!B71=\"\",\"\",'Outgoings - Fixed'!B71)","v":""},null,null,{"$f":"'Outgoings - Fixed'!D71","v":0},{"$f":"'Outgoings - Fixed'!F71","v":"M"},{"$f":"IF(G124=\"W\",F124*52/12,IF(OR(G124=\"M\",LEN(G124)=0),F124,IF(G124=\"Q\",F124/3,IF(G124=\"F\",F124*26/12,IF(OR(G124=\"A\",G124=\"Y\"),F124/12,F124)))))","v":0},null,null,null,null,null,null,null,{"$f":"VLOOKUP(Conversions!B124,'Outgoings - Fixed'!$A$4:$H$73,8,FALSE)","v":false},{"$f":"IF(P124=TRUE,CONCATENATE('Outgoings - Fixed'!$B$69,\" / \",'Outgoings - Fixed'!B71,\" / \",'Outgoings - Fixed'!J71),\"\")","v":""},null,{"$f":"IF(P124=TRUE,'Outgoings - Fixed'!J71,\"\")","v":""}]
[null,{"$f":"'Outgoings - Fixed'!A72","v":70},{"$f":"IF('Outgoings - Fixed'!B72=\"\",\"\",'Outgoings - Fixed'!B72)","v":""},null,null,{"$f":"'Outgoings - Fixed'!D72","v":0},{"$f":"'Outgoings - Fixed'!F72","v":"M"},{"$f":"IF(G125=\"W\",F125*52/12,IF(OR(G125=\"M\",LEN(G125)=0),F125,IF(G125=\"Q\",F125/3,IF(G125=\"F\",F125*26/12,IF(OR(G125=\"A\",G125=\"Y\"),F125/12,F125)))))","v":0},null,null,null,null,null,null,null,{"$f":"VLOOKUP(Conversions!B125,'Outgoings - Fixed'!$A$4:$H$73,8,FALSE)","v":false},{"$f":"IF(P125=TRUE,CONCATENATE('Outgoings - Fixed'!$B$69,\" / \",'Outgoings - Fixed'!B72,\" / \",'Outgoings - Fixed'!J72),\"\")","v":""},null,{"$f":"IF(P125=TRUE,'Outgoings - Fixed'!J72,\"\")","v":""}]
[null,{"$f":"'Outgoings - Fixed'!A73","v":71},{"$f":"IF('Outgoings - Fixed'!B73=\"\",\"\",'Outgoings - Fixed'!B73)","v":""},null,null,{"$f":"'Outgoings - Fixed'!D73","v":0},{"$f":"'Outgoings - Fixed'!F73","v":"M"},{"$f":"IF(G126=\"W\",F126*52/12,IF(OR(G126=\"M\",LEN(G126)=0),F126,IF(G126=\"Q\",F126/3,IF(G126=\"F\",F126*26/12,IF(OR(G126=\"A\",G126=\"Y\"),F126/12,F126)))))","v":0},null,null,null,null,null,null,null,{"$f":"VLOOKUP(Conversions!B126,'Outgoings - Fixed'!$A$4:$H$73,8,FALSE)","v":false},{"$f":"IF(P126=TRUE,CONCATENATE('Outgoings - Fixed'!$B$69,\" / \",'Outgoings - Fixed'!B73,\" / \",'Outgoings - Fixed'!J73),\"\")","v":""},null,{"$f":"IF(P126=TRUE,'Outgoings - Fixed'!J73,\"\")","v":""}]
[null,null,null,null,null,null,null,null,null,null,null,null,null,null,null,{"$f":"IF(P122=TRUE,TRUE,FALSE)","v":false},"\"",null,{"$f":"Q127","v":"\""}]
[null,null,{"$f":"'Outgoings - Fixed'!B74","v":"Total other essential costs per month"},null,null,null,null,{"$f":"SUM(H123:H127)","v":0}]
[null,null,{"$f":"'Outgoings - Fixed'!B76","v":"Monthly total fixed cost outgoings"},null,null,null,null,{"$f":"H128+H120+H113+H104+H97+H85+H75+H69+H61","v":0}]
[]
[]
[null,{"$f":"\"Monthly Outgoings Flexible - \" &'Outgoings - Flexible'!B3","v":"Monthly Outgoings Flexible - Communications and leisure"},null,null,null,"£ Amount",null,"£ Monthly",null,null,null,null,null,null,null,{"$f":"IF(Q132=\"\",FALSE,TRUE)","v":false},{"$f":"IF(COUNTIF(P133:P139,TRUE)>0,B132,\"\")","v":""},null,{"$f":"IF(COUNTIF(P133:P139,TRUE)>0,Q132,\"\")","v":""}]
[null,{"$f":"'Outgoings - Flexible'!A4","v":72},{"$f":"'Outgoings - Flexible'!B4","v":"Home phone, internet, TV package  \n(including film subscriptions)"},null,null,{"$f":"'Outgoings - Flexible'!D4","v":0},{"$f":"'Outgoings - Flexible'!F4","v":"M"},{"$f":"IF(G133=\"W\",F133*52/12,IF(OR(G133=\"M\",LEN(G133)=0),F133,IF(G133=\"Q\",F133/3,IF(G133=\"F\",F133*26/12,IF(OR(G133=\"A\",G133=\"Y\"),F133/12,F133)))))","v":0},null,null,null,null,null,null,null,{"$f":"VLOOKUP(Conversions!B133,'Outgoings - Flexible'!$A$4:$H$66,8,FALSE)","v":false},{"$f":"IF(P133=TRUE,CONCATENATE('Outgoings - Flexible'!$B$3,\" / \",'Outgoings - Flexible'!B4,\" / \",'Outgoings - Flexible'!J4),\"\")","v":""},null,{"$f":"IF(P133=TRUE,'Outgoings - Flexible'!J4,\"\")","v":""}]
[null,{"$f":"'Outgoings - Flexible'!A5","v":73},{"$f":"'Outgoings - Flexible'!B5","v":"Mobile phone "},null,null,{"$f":"'Outgoings - Flexible'!D5","v":0},{"$f":"'Outgoings - Flexible'!F5","v":"M"},0,null,null,null,null,null,null,null,{"$f":"VLOOKUP(Conversions!B134,'Outgoings - Flexible'!$A$4:$H$66,8,FALSE)","v":false},{"$f":"IF(P134=TRUE,CONCATENATE('Outgoings - Flexible'!$B$3,\" / \",'Outgoings - Flexible'!B5,\" / \",'Outgoings - Flexible'!J5),\"\")","v":""},null,{"$f":"IF(P134=TRUE,'Outgoings - Flexible'!J5,\"\")","v":""}]
[null,{"$f":"'Outgoings - Flexible'!A6","v":74},{"$f":"'Outgoings - Flexible'!B6","v":"Hobbies, leisure or sport  \n(e.g. socialising, eating out, outings, clubs, leisure courses)"},null,null,{"$f":"'Outgoings - Flexible'!D6","v":0},{"$f":"'Outgoings - Flexible'!F6","v":"M"},0,null,null,null,null,null,null,null,{"$f":"VLOOKUP(Conversions!B135,'Outgoings - Flexible'!$A$4:$H$66,8,FALSE)","v":false},{"$f":"IF(P135=TRUE,CONCATENATE('Outgoings - Flexible'!$B$3,\" / \",'Outgoings - Flexible'!B6,\" / \",'Outgoings - Flexible'!J6),\"\")","v":""},null,{"$f":"IF(P135=TRUE,'Outgoings - Flexible'!J6,\"\")","v":""}]
[null,{"$f":"'Outgoings - Flexible'!A7","v":75},{"$f":"'Outgoings - Flexible'!B7","v":"Gifts (e.g. birthdays, festivals, charity donations)"},null,null,{"$f":"'Outgoings - Flexible'!D7","v":0},{"$f":"'Outgoings - Flexible'!F7","v":"M"},0,null,null,null,null,null,null,null,{"$f":"VLOOKUP(Conversions!B136,'Outgoings - Flexible'!$A$4:$H$66,8,FALSE)","v":false},{"$f":"IF(P136=TRUE,CONCATENATE('Outgoings - Flexible'!$B$3,\" / \",'Outgoings - Flexible'!B7,\" / \",'Outgoings - Flexible'!J7),\"\")","v":""},null,{"$f":"IF(P136=TRUE,'Outgoings - Flexible'!J7,\"\")","v":""}]
[null,{"$f":"'Outgoings - Flexible'!A8","v":76},{"$f":"'Outgoings - Flexible'!B8","v":"Pocket money"},null,null,{"$f":"'Outgoings - Flexible'!D8","v":0},{"$f":"'Outgoings - Flexible'!F8","v":"M"},0,null,null,null,null,null,null,null,{"$f":"VLOOKUP(Conversions!B137,'Outgoings - Flexible'!$A$4:$H$66,8,FALSE)","v":false},{"$f":"IF(P137=TRUE,CONCATENATE('Outgoings - Flexible'!$B$3,\" / \",'Outgoings - Flexible'!B8,\" / \",'Outgoings - Flexible'!J8),\"\")","v":""},null,{"$f":"IF(P137=TRUE,'Outgoings - Flexible'!J8,\"\")","v":""}]
[null,{"$f":"'Outgoings - Flexible'!A9","v":77},{"$f":"'Outgoings - Flexible'!B9","v":"Newspapers, magazines, stationery and postage"},null,null,{"$f":"'Outgoings - Flexible'!D9","v":0},{"$f":"'Outgoings - Flexible'!F9","v":"M"},0,null,null,null,null,null,null,null,{"$f":"VLOOKUP(Conversions!B138,'Outgoings - Flexible'!$A$4:$H$66,8,FALSE)","v":false},{"$f":"IF(P138=TRUE,CONCATENATE('Outgoings - Flexible'!$B$3,\" / \",'Outgoings - Flexible'!B9,\" / \",'Outgoings - Flexible'!J9),\"\")","v":""},null,{"$f":"IF(P138=TRUE,'Outgoings - Flexible'!J9,\"\")","v":""}]
[null,{"$f":"'Outgoings - Flexible'!A10","v":78},{"$f":"'Outgoings - Flexible'!B10","v":"Other costs"},null,null,{"$f":"'Outgoings - Flexible'!D10","v":0},{"$f":"'Outgoings - Flexible'!F10","v":"M"},0,null,null,null,null,null,null,null,{"$f":"VLOOKUP(Conversions!B139,'Outgoings - Flexible'!$A$4:$H$66,8,FALSE)","v":false},{"$f":"IF(P139=TRUE,CONCATENATE('Outgoings - Flexible'!$B$3,\" / \",'Outgoings - Flexible'!B10,\" / \",'Outgoings - Flexible'!J10),\"\")","v":""},null,{"$f":"IF(P139=TRUE,'Outgoings - Flexible'!J10,\"\")","v":""}]
[null,null,null,null,null,null,null,null,null,null,null,null,null,null,null,{"$f":"IF(P132=TRUE,TRUE,FALSE)","v":false},"\"",null,{"$f":"Q140","v":"\""}]
[null,null,{"$f":"'Outgoings - Flexible'!B11","v":"Total communications and leisure costs per month"},null,null,null,null,{"$f":"SUM(H133:H140)","v":0}]
[]
[null,{"$f":"\"Monthly Outgoings Flexible - \" &'Outgoings - Flexible'!B13","v":"Monthly Outgoings Flexible - Food and housekeeping "},null,null,null,"£ Amount",null,"£ Monthly",null,null,null,null,null,null,null,{"$f":"IF(Q143=\"\",FALSE,TRUE)","v":false},{"$f":"IF(COUNTIF(P144:P152,TRUE)>0,B143,\"\")","v":""},null,{"$f":"IF(COUNTIF(P144:P152,TRUE)>0,Q143,\"\")","v":""}]
[null,{"$f":"'Outgoings - Flexible'!A14","v":79},{"$f":"'Outgoings - Flexible'!B14","v":"Groceries (e.g. food, pet food,  \nnon-alcoholic drinks, cleaning)"},null,null,{"$f":"'Outgoings - Flexible'!D14","v":0},{"$f":"'Outgoings - Flexible'!F14","v":"M"},{"$f":"IF(G144=\"W\",F144*52/12,IF(OR(G144=\"M\",LEN(G144)=0),F144,IF(G144=\"Q\",F144/3,IF(G144=\"F\",F144*26/12,IF(OR(G144=\"A\",G144=\"Y\"),F144/12,F144)))))","v":0},null,null,null,null,null,null,null,{"$f":"VLOOKUP(Conversions!B144,'Outgoings - Flexible'!$A$4:$H$66,8,FALSE)","v":false},{"$f":"IF(P144=TRUE,CONCATENATE('Outgoings - Flexible'!$B$13,\" / \",'Outgoings - Flexible'!B14,\" / \",'Outgoings - Flexible'!J14),\"\")","v":""},null,{"$f":"IF(P144=TRUE,'Outgoings - Flexible'!J14,\"\")","v":""}]
[null,{"$f":"'Outgoings - Flexible'!A15","v":80},{"$f":"'Outgoings - Flexible'!B15","v":"Nappies and baby items"},null,null,{"$f":"'Outgoings - Flexible'!D15","v":0},{"$f":"'Outgoings - Flexible'!F15","v":"M"},0,null,null,null,null,null,null,null,{"$f":"VLOOKUP(Conversions!B145,'Outgoings - Flexible'!$A$4:$H$66,8,FALSE)","v":false},{"$f":"IF(P145=TRUE,CONCATENATE('Outgoings - Flexible'!$B$13,\" / \",'Outgoings - Flexible'!B15,\" / \",'Outgoings - Flexible'!J15),\"\")","v":""},null,{"$f":"IF(P145=TRUE,'Outgoings - Flexible'!J15,\"\")","v":""}]
[null,{"$f":"'Outgoings - Flexible'!A16","v":81},{"$f":"'Outgoings - Flexible'!B16","v":"School meals and meals at work"},null,null,{"$f":"'Outgoings - Flexible'!D16","v":0},{"$f":"'Outgoings - Flexible'!F16","v":"M"},0,null,null,null,null,null,null,null,{"$f":"VLOOKUP(Conversions!B146,'Outgoings - Flexible'!$A$4:$H$66,8,FALSE)","v":false},{"$f":"IF(P146=TRUE,CONCATENATE('Outgoings - Flexible'!$B$13,\" / \",'Outgoings - Flexible'!B16,\" / \",'Outgoings - Flexible'!J16),\"\")","v":""},null,{"$f":"IF(P146=TRUE,'Outgoings - Flexible'!J16,\"\")","v":""}]
[null,{"$f":"'Outgoings - Flexible'!A17","v":82},{"$f":"'Outgoings - Flexible'!B17","v":"Laundry and dry cleaning"},null,null,{"$f":"'Outgoings - Flexible'!D17","v":0},{"$f":"'Outgoings - Flexible'!F17","v":"M"},0,null,null,null,null,null,null,null,{"$f":"VLOOKUP(Conversions!B147,'Outgoings - Flexible'!$A$4:$H$66,8,FALSE)","v":false},{"$f":"IF(P147=TRUE,CONCATENATE('Outgoings - Flexible'!$B$13,\" / \",'Outgoings - Flexible'!B17,\" / \",'Outgoings - Flexible'!J17),\"\")","v":""},null,{"$f":"IF(P147=TRUE,'Outgoings - Flexible'!J17,\"\")","v":""}]
[null,{"$f":"'Outgoings - Flexible'!A18","v":83},{"$f":"'Outgoings - Flexible'!B18","v":"Alcohol"},null,null,{"$f":"'Outgoings - Flexible'!D18","v":0},{"$f":"'Outgoings - Flexible'!F18","v":"M"},0,null,null,null,null,null,null,null,{"$f":"VLOOKUP(Conversions!B148,'Outgoings - Flexible'!$A$4:$H$66,8,FALSE)","v":false},{"$f":"IF(P148=TRUE,CONCATENATE('Outgoings - Flexible'!$B$13,\" / \",'Outgoings - Flexible'!B18,\" / \",'Outgoings - Flexible'!J18),\"\")","v":""},null,{"$f":"IF(P148=TRUE,'Outgoings - Flexible'!J18,\"\")","v":""}]
[null,{"$f":"'Outgoings - Flexible'!A19","v":84},{"$f":"'Outgoings - Flexible'!B19","v":"Smoking products"},null,null,{"$f":"'Outgoings - Flexible'!D19","v":0},{"$f":"'Outgoings - Flexible'!F19","v":"M"},0,null,null,null,null,null,null,null,{"$f":"VLOOKUP(Conversions!B149,'Outgoings - Flexible'!$A$4:$H$66,8,FALSE)","v":false},{"$f":"IF(P149=TRUE,CONCATENATE('Outgoings - Flexible'!$B$13,\" / \",'Outgoings - Flexible'!B19,\" / \",'Outgoings - Flexible'!J19),\"\")","v":""},null,{"$f":"IF(P149=TRUE,'Outgoings - Flexible'!J19,\"\")","v":""}]
[null,{"$f":"'Outgoings - Flexible'!A20","v":85},{"$f":"'Outgoings - Flexible'!B20","v":"Vet bills & pet insurance"},null,null,{"$f":"'Outgoings - Flexible'!D20","v":0},{"$f":"'Outgoings - Flexible'!F20","v":"M"},0,null,null,null,null,null,null,null,{"$f":"VLOOKUP(Conversions!B150,'Outgoings - Flexible'!$A$4:$H$66,8,FALSE)","v":false},{"$f":"IF(P150=TRUE,CONCATENATE('Outgoings - Flexible'!$B$13,\" / \",'Outgoings - Flexible'!B20,\" / \",'Outgoings - Flexible'!J20),\"\")","v":""},null,{"$f":"IF(P150=TRUE,'Outgoings - Flexible'!J20,\"\")","v":""}]
[null,{"$f":"'Outgoings - Flexible'!A21","v":86},{"$f":"'Outgoings - Flexible'!B21","v":"House repairs and maintenance"},null,null,{"$f":"'Outgoings - Flexible'!D21","v":0},{"$f":"'Outgoings - Flexible'!F21","v":"M"},0,null,null,null,null,null,null,null,{"$f":"VLOOKUP(Conversions!B151,'Outgoings - Flexible'!$A$4:$H$66,8,FALSE)","v":false},{"$f":"IF(P151=TRUE,CONCATENATE('Outgoings - Flexible'!$B$13,\" / \",'Outgoings - Flexible'!B21,\" / \",'Outgoings - Flexible'!J21),\"\")","v":""},null,{"$f":"IF(P151=TRUE,'Outgoings - Flexible'!J21,\"\")","v":""}]
[null,{"$f":"'Outgoings - Flexible'!A22","v":87},{"$f":"'Outgoings - Flexible'!B22","v":"Other costs"},null,null,{"$f":"'Outgoings - Flexible'!D22","v":0},{"$f":"'Outgoings - Flexible'!F22","v":"M"},0,null,null,null,null,null,null,null,{"$f":"VLOOKUP(Conversions!B152,'Outgoings - Flexible'!$A$4:$H$66,8,FALSE)","v":false},{"$f":"IF(P152=TRUE,CONCATENATE('Outgoings - Flexible'!$B$13,\" / \",'Outgoings - Flexible'!B22,\" / \",'Outgoings - Flexible'!J22),\"\")","v":""},null,{"$f":"IF(P152=TRUE,'Outgoings - Flexible'!J22,\"\")","v":""}]
[null,null,null,null,null,null,null,null,null,null,null,null,null,null,null,{"$f":"IF(P143=TRUE,TRUE,FALSE)","v":false},"\"",null,{"$f":"Q153","v":"\""}]
[null,null,"Total food and housekeeping costs per month",null,null,null,null,{"$f":"SUM(H144:H153)","v":0}]
[]
[null,{"$f":"\"Monthly Outgoings Flexible - \" &'Outgoings - Flexible'!B25","v":"Monthly Outgoings Flexible - Personal costs "},null,null,null,"£ Amount",null,"£ Monthly",null,null,null,null,null,null,null,{"$f":"IF(Q156=\"\",FALSE,TRUE)","v":false},{"$f":"IF(COUNTIF(P157:P160,TRUE)>0,B156,\"\")","v":""},null,{"$f":"IF(COUNTIF(P157:P160,TRUE)>0,Q156,\"\")","v":""}]
[null,{"$f":"'Outgoings - Flexible'!A26","v":88},{"$f":"'Outgoings - Flexible'!B26","v":"Clothing and footwear"},null,null,{"$f":"'Outgoings - Flexible'!D26","v":0},{"$f":"'Outgoings - Flexible'!F26","v":"M"},{"$f":"IF(G157=\"W\",F157*52/12,IF(OR(G157=\"M\",LEN(G157)=0),F157,IF(G157=\"Q\",F157/3,IF(G157=\"F\",F157*26/12,IF(OR(G157=\"A\",G157=\"Y\"),F157/12,F157)))))","v":0},null,null,null,null,null,null,null,{"$f":"VLOOKUP(Conversions!B157,'Outgoings - Flexible'!$A$4:$H$66,8,FALSE)","v":false},{"$f":"IF(P157=TRUE,CONCATENATE('Outgoings - Flexible'!$B$25,\" / \",'Outgoings - Flexible'!B26,\" / \",'Outgoings - Flexible'!J26),\"\")","v":""},null,{"$f":"IF(P157=TRUE,'Outgoings - Flexible'!J26,\"\")","v":""}]
[null,{"$f":"'Outgoings - Flexible'!A27","v":89},{"$f":"'Outgoings - Flexible'!B27","v":"Hairdressing"},null,null,{"$f":"'Outgoings - Flexible'!D27","v":0},{"$f":"'Outgoings - Flexible'!F27","v":"M"},{"$f":"IF(G158=\"W\",F158*52/12,IF(OR(G158=\"M\",LEN(G158)=0),F158,IF(G158=\"Q\",F158/3,IF(G158=\"F\",F158*26/12,IF(OR(G158=\"A\",G158=\"Y\"),F158/12,F158)))))","v":0},null,null,null,null,null,null,null,{"$f":"VLOOKUP(Conversions!B158,'Outgoings - Flexible'!$A$4:$H$66,8,FALSE)","v":false},{"$f":"IF(P158=TRUE,CONCATENATE('Outgoings - Flexible'!$B$25,\" / \",'Outgoings - Flexible'!B27,\" / \",'Outgoings - Flexible'!J27),\"\")","v":""},null,{"$f":"IF(P158=TRUE,'Outgoings - Flexible'!J27,\"\")","v":""}]
[null,{"$f":"'Outgoings - Flexible'!A28","v":90},{"$f":"'Outgoings - Flexible'!B28","v":"Toiletries"},null,null,{"$f":"'Outgoings - Flexible'!D28","v":0},{"$f":"'Outgoings - Flexible'!F28","v":"M"},{"$f":"IF(G159=\"W\",F159*52/12,IF(OR(G159=\"M\",LEN(G159)=0),F159,IF(G159=\"Q\",F159/3,IF(G159=\"F\",F159*26/12,IF(OR(G159=\"A\",G159=\"Y\"),F159/12,F159)))))","v":0},null,null,null,null,null,null,null,{"$f":"VLOOKUP(Conversions!B159,'Outgoings - Flexible'!$A$4:$H$66,8,FALSE)","v":false},{"$f":"IF(P159=TRUE,CONCATENATE('Outgoings - Flexible'!$B$25,\" / \",'Outgoings - Flexible'!B28,\" / \",'Outgoings - Flexible'!J28),\"\")","v":""},null,{"$f":"IF(P159=TRUE,'Outgoings - Flexible'!J28,\"\")","v":""}]
[null,{"$f":"'Outgoings - Flexible'!A29","v":91},{"$f":"'Outgoings - Flexible'!B29","v":"Other costs"},null,null,{"$f":"'Outgoings - Flexible'!D29","v":0},{"$f":"'Outgoings - Flexible'!F29","v":"M"},{"$f":"IF(G160=\"W\",F160*52/12,IF(OR(G160=\"M\",LEN(G160)=0),F160,IF(G160=\"Q\",F160/3,IF(G160=\"F\",F160*26/12,IF(OR(G160=\"A\",G160=\"Y\"),F160/12,F160)))))","v":0},null,null,null,null,null,null,null,{"$f":"VLOOKUP(Conversions!B160,'Outgoings - Flexible'!$A$4:$H$66,8,FALSE)","v":false},{"$f":"IF(P160=TRUE,CONCATENATE('Outgoings - Flexible'!$B$25,\" / \",'Outgoings - Flexible'!B29,\" / \",'Outgoings - Flexible'!J29),\"\")","v":""},null,{"$f":"IF(P160=TRUE,'Outgoings - Flexible'!J29,\"\")","v":""}]
[null,null,null,null,null,null,null,null,null,null,null,null,null,null,null,{"$f":"IF(P156=TRUE,TRUE,FALSE)","v":false},"\"",null,"\""]
[null,null,{"$f":"'Outgoings - Flexible'!B30","v":"Total personal costs per month"},null,null,null,null,{"$f":"SUM(H157:H161)","v":0}]
[null,null,{"$f":"'Outgoings - Flexible'!B32","v":"Monthly total flexible cost outgoings"},null,null,null,null,{"$f":"H162 + H154 +H141","v":0}]
[null,null,{"$f":"'Outgoings - Flexible'!B34","v":"Monthly total outgoings"},null,null,null,null,{"$f":"H129+H163","v":0}]
[]
[null,{"$f":"Debts!B3","v":"Priority debts"},null,null,"£ Owed","£ Repayment",null,"£ Monthly",null,null,null,null,null,null,null,{"$f":"IF(Q166=\"\",FALSE,TRUE)","v":false},{"$f":"IF(COUNTIF(P167:P262,TRUE)>0,B166,\"\")","v":""},null,{"$f":"IF(COUNTIF(P167:P262,TRUE)>0,Q166,\"\")","v":""}]
[null,{"$f":"Debts!A6","v":92},{"$f":"Debts!B6","v":0},null,{"$f":"Debts!D6","v":0},{"$f":"Debts!F6","v":0},{"$f":"Debts!H6","v":"M"},{"$f":"IF(G167=\"W\",F167*52/12,IF(OR(G167=\"M\",LEN(G167)=0),F167,IF(G167=\"Q\",F167/3,IF(G167=\"F\",F167*26/12,IF(OR(G167=\"A\",G167=\"Y\"),F167/12,F167)))))","v":0},null,null,null,null,null,null,null,{"$f":"Debts!L6","v":false},{"$f":"IF(P167=TRUE,CONCATENATE(Debts!$B$3,\"/\",Debts!B6,\"/\",Debts!N6),\"\")","v":""},null,{"$f":"IF(P167=TRUE,CONCATENATE(Debts!B6,\" - \",Debts!N6),\"\")","v":""}]
[null,{"$f":"Debts!A7","v":93},{"$f":"Debts!B7","v":0},null,{"$f":"Debts!D7","v":0},{"$f":"Debts!F7","v":0},{"$f":"Debts!H7","v":"M"},0,null,null,null,null,null,null,null,{"$f":"Debts!L7","v":false},{"$f":"IF(P168=TRUE,CONCATENATE(Debts!$B$3,\"/\",Debts!B7,\"/\",Debts!N7),\"\")","v":""},null,{"$f":"IF(P168=TRUE,CONCATENATE(Debts!B7,\" - \",Debts!N7),\"\")","v":""}]
[null,{"$f":"Debts!A8","v":94},{"$f":"Debts!B8","v":0},null,{"$f":"Debts!D8","v":0},{"$f":"Debts!F8","v":0},{"$f":"Debts!H8","v":"M"},0,null,null,null,null,null,null,null,{"$f":"Debts!L8","v":false},{"$f":"IF(P169=TRUE,CONCATENATE(Debts!$B$3,\"/\",Debts!B8,\"/\",Debts!N8),\"\")","v":""},null,{"$f":"IF(P169=TRUE,CONCATENATE(Debts!B8,\" - \",Debts!N8),\"\")","v":""}]
[null,{"$f":"Debts!A9","v":95},{"$f":"Debts!B9","v":0},null,{"$f":"Debts!D9","v":0},{"$f":"Debts!F9","v":0},{"$f":"Debts!H9","v":"M"},0,null,null,null,null,null,null,null,{"$f":"Debts!L9","v":false},{"$f":"IF(P170=TRUE,CONCATENATE(Debts!$B$3,\"/\",Debts!B9,\"/\",Debts!N9),\"\")","v":""},null,{"$f":"IF(P170=TRUE,CONCATENATE(Debts!B9,\" - \",Debts!N9),\"\")","v":""}]
[null,{"$f":"Debts!A10","v":96},{"$f":"Debts!B10","v":0},null,{"$f":"Debts!D10","v":0},{"$f":"Debts!F10","v":0},{"$f":"Debts!H10","v":"M"},0,null,null,null,null,null,null,null,{"$f":"Debts!L10","v":false},{"$f":"IF(P171=TRUE,CONCATENATE(Debts!$B$3,\"/\",Debts!B10,\"/\",Debts!N10),\"\")","v":""},null,{"$f":"IF(P171=TRUE,CONCATENATE(Debts!B10,\" - \",Debts!N10),\"\")","v":""}]
[null,{"$f":"Debts!A11","v":97},{"$f":"Debts!B11","v":0},null,{"$f":"Debts!D11","v":0},{"$f":"Debts!F11","v":0},{"$f":"Debts!H11","v":"M"},0,null,null,null,null,null,null,null,{"$f":"Debts!L11","v":false},{"$f":"IF(P172=TRUE,CONCATENATE(Debts!$B$3,\"/\",Debts!B11,\"/\",Debts!N11),\"\")","v":""},null,{"$f":"IF(P172=TRUE,CONCATENATE(Debts!B11,\" - \",Debts!N11),\"\")","v":""}]
[null,{"$f":"Debts!A12","v":98},{"$f":"Debts!B12","v":0},null,{"$f":"Debts!D12","v":0},{"$f":"Debts!F12","v":0},{"$f":"Debts!H12","v":"M"},0,null,null,null,null,null,null,null,{"$f":"Debts!L12","v":false},{"$f":"IF(P173=TRUE,CONCATENATE(Debts!$B$3,\"/\",Debts!B12,\"/\",Debts!N12),\"\")","v":""},null,{"$f":"IF(P173=TRUE,CONCATENATE(Debts!B12,\" - \",Debts!N12),\"\")","v":""}]
[null,{"$f":"Debts!A13","v":99},{"$f":"Debts!B13","v":0},null,{"$f":"Debts!D13","v":0},{"$f":"Debts!F13","v":0},{"$f":"Debts!H13","v":"M"},0,null,null,null,null,null,null,null,{"$f":"Debts!L13","v":false},{"$f":"IF(P174=TRUE,CONCATENATE(Debts!$B$3,\"/\",Debts!B13,\"/\",Debts!N13),\"\")","v":""},null,{"$f":"IF(P174=TRUE,CONCATENATE(Debts!B13,\" - \",Debts!N13),\"\")","v":""}]
[null,{"$f":"Debts!A14","v":100},{"$f":"Debts!B14","v":0},null,{"$f":"Debts!D14","v":0},{"$f":"Debts!F14","v":0},{"$f":"Debts!H14","v":"M"},0,null,null,null,null,null,null,null,{"$f":"Debts!L14","v":false},{"$f":"IF(P175=TRUE,CONCATENATE(Debts!$B$3,\"/\",Debts!B14,\"/\",Debts!N14),\"\")","v":""},null,{"$f":"IF(P175=TRUE,CONCATENATE(Debts!B14,\" - \",Debts!N14),\"\")","v":""}]
[null,{"$f":"Debts!A15","v":101},{"$f":"Debts!B15","v":0},null,{"$f":"Debts!D15","v":0},{"$f":"Debts!F15","v":0},{"$f":"Debts!H15","v":"M"},0,null,null,null,null,null,null,null,{"$f":"Debts!L15","v":false},{"$f":"IF(P176=TRUE,CONCATENATE(Debts!$B$3,\"/\",Debts!B15,\"/\",Debts!N15),\"\")","v":""},null,{"$f":"IF(P176=TRUE,CONCATENATE(Debts!B15,\" - \",Debts!N15),\"\")","v":""}]
[null,{"$f":"Debts!A16","v":102},{"$f":"Debts!B16","v":0},null,{"$f":"Debts!D16","v":0},{"$f":"Debts!F16","v":0},{"$f":"Debts!H16","v":"M"},0,null,null,null,null,null,null,null,{"$f":"Debts!L16","v":false},{"$f":"IF(P177=TRUE,CONCATENATE(Debts!$B$3,\"/\",Debts!B16,\"/\",Debts!N16),\"\")","v":""},null,{"$f":"IF(P177=TRUE,CONCATENATE(Debts!B16,\" - \",Debts!N16),\"\")","v":""}]
[null,{"$f":"Debts!A17","v":103},{"$f":"Debts!B17","v":0},null,{"$f":"Debts!D17","v":0},{"$f":"Debts!F17","v":0},{"$f":"Debts!H17","v":"M"},0,null,null,null,null,null,null,null,{"$f":"Debts!L17","v":false},{"$f":"IF(P178=TRUE,CONCATENATE(Debts!$B$3,\"/\",Debts!B17,\"/\",Debts!N17),\"\")","v":""},null,{"$f":"IF(P178=TRUE,CONCATENATE(Debts!B17,\" - \",Debts!N17),\"\")","v":""}]
[null,{"$f":"Debts!A18","v":104},{"$f":"Debts!B18","v":0},null,{"$f":"Debts!D18","v":0},{"$f":"Debts!F18","v":0},{"$f":"Debts!H18","v":"M"},0,null,null,null,null,null,null,null,{"$f":"Debts!L18","v":false},{"$f":"IF(P179=TRUE,CONCATENATE(Debts!$B$3,\"/\",Debts!B18,\"/\",Debts!N18),\"\")","v":""},null,{"$f":"IF(P179=TRUE,CONCATENATE(Debts!B18,\" - \",Debts!N18),\"\")","v":""}]
[null,{"$f":"Debts!A19","v":105},{"$f":"Debts!B19","v":0},null,{"$f":"Debts!D19","v":0},{"$f":"Debts!F19","v":0},{"$f":"Debts!H19","v":"M"},0,null,null,null,null,null,null,null,{"$f":"Debts!L19","v":false},{"$f":"IF(P180=TRUE,CONCATENATE(Debts!$B$3,\"/\",Debts!B19,\"/\",Debts!N19),\"\")","v":""},null,{"$f":"IF(P180=TRUE,CONCATENATE(Debts!B19,\" - \",Debts!N19),\"\")","v":""}]
[null,{"$f":"Debts!A20","v":106},{"$f":"Debts!B20","v":0},null,{"$f":"Debts!D20","v":0},{"$f":"Debts!F20","v":0},{"$f":"Debts!H20","v":"M"},0,null,null,null,null,null,null,null,{"$f":"Debts!L20","v":false},{"$f":"IF(P181=TRUE,CONCATENATE(Debts!$B$3,\"/\",Debts!B20,\"/\",Debts!N20),\"\")","v":""},null,{"$f":"IF(P181=TRUE,CONCATENATE(Debts!B20,\" - \",Debts!N20),\"\")","v":""}]
[null,{"$f":"Debts!A21","v":107},{"$f":"Debts!B21","v":0},null,{"$f":"Debts!D21","v":0},{"$f":"Debts!F21","v":0},{"$f":"Debts!H21","v":"M"},0,null,null,null,null,null,null,null,{"$f":"Debts!L21","v":false},{"$f":"IF(P182=TRUE,CONCATENATE(Debts!$B$3,\"/\",Debts!B21,\"/\",Debts!N21),\"\")","v":""},null,{"$f":"IF(P182=TRUE,CONCATENATE(Debts!B21,\" - \",Debts!N21),\"\")","v":""}]
[null,{"$f":"Debts!A22","v":108},{"$f":"Debts!B22","v":0},null,{"$f":"Debts!D22","v":0},{"$f":"Debts!F22","v":0},{"$f":"Debts!H22","v":"M"},0,null,null,null,null,null,null,null,{"$f":"Debts!L22","v":false},{"$f":"IF(P183=TRUE,CONCATENATE(Debts!$B$3,\"/\",Debts!B22,\"/\",Debts!N22),\"\")","v":""},null,{"$f":"IF(P183=TRUE,CONCATENATE(Debts!B22,\" - \",Debts!N22),\"\")","v":""}]
[null,{"$f":"Debts!A23","v":109},{"$f":"Debts!B23","v":0},null,{"$f":"Debts!D23","v":0},{"$f":"Debts!F23","v":0},{"$f":"Debts!H23","v":"M"},0,null,null,null,null,null,null,null,{"$f":"Debts!L23","v":false},{"$f":"IF(P184=TRUE,CONCATENATE(Debts!$B$3,\"/\",Debts!B23,\"/\",Debts!N23),\"\")","v":""},null,{"$f":"IF(P184=TRUE,CONCATENATE(Debts!B23,\" - \",Debts!N23),\"\")","v":""}]
[null,{"$f":"Debts!A24","v":110},{"$f":"Debts!B24","v":0},null,{"$f":"Debts!D24","v":0},{"$f":"Debts!F24","v":0},{"$f":"Debts!H24","v":"M"},0,null,null,null,null,null,null,null,{"$f":"Debts!L24","v":false},{"$f":"IF(P185=TRUE,CONCATENATE(Debts!$B$3,\"/\",Debts!B24,\"/\",Debts!N24),\"\")","v":""},null,{"$f":"IF(P185=TRUE,CONCATENATE(Debts!B24,\" - \",Debts!N24),\"\")","v":""}]
[null,{"$f":"Debts!A25","v":111},{"$f":"Debts!B25","v":0},null,{"$f":"Debts!D25","v":0},{"$f":"Debts!F25","v":0},{"$f":"Debts!H25","v":"M"},0,null,null,null,null,null,null,null,{"$f":"Debts!L25","v":false},{"$f":"IF(P186=TRUE,CONCATENATE(Debts!$B$3,\"/\",Debts!B25,\"/\",Debts!N25),\"\")","v":""},null,{"$f":"IF(P186=TRUE,CONCATENATE(Debts!B25,\" - \",Debts!N25),\"\")","v":""}]
[null,{"$f":"Debts!A26","v":112},{"$f":"Debts!B26","v":0},null,{"$f":"Debts!D26","v":0},{"$f":"Debts!F26","v":0},{"$f":"Debts!H26","v":"M"},0,null,null,null,null,null,null,null,{"$f":"Debts!L26","v":false},{"$f":"IF(P187=TRUE,CONCATENATE(Debts!$B$3,\"/\",Debts!B26,\"/\",Debts!N26),\"\")","v":""},null,{"$f":"IF(P187=TRUE,CONCATENATE(Debts!B26,\" - \",Debts!N26),\"\")","v":""}]
[null,{"$f":"Debts!A27","v":113},{"$f":"Debts!B27","v":0},null,{"$f":"Debts!D27","v":0},{"$f":"Debts!F27","v":0},{"$f":"Debts!H27","v":"M"},0,null,null,null,null,null,null,null,{"$f":"Debts!L27","v":false},{"$f":"IF(P188=TRUE,CONCATENATE(Debts!$B$3,\"/\",Debts!B27,\"/\",Debts!N27),\"\")","v":""},null,{"$f":"IF(P188=TRUE,CONCATENATE(Debts!B27,\" - \",Debts!N27),\"\")","v":""}]
[null,{"$f":"Debts!A28","v":114},{"$f":"Debts!B28","v":0},null,{"$f":"Debts!D28","v":0},{"$f":"Debts!F28","v":0},{"$f":"Debts!H28","v":"M"},0,null,null,null,null,null,null,null,{"$f":"Debts!L28","v":false},{"$f":"IF(P189=TRUE,CONCATENATE(Debts!$B$3,\"/\",Debts!B28,\"/\",Debts!N28),\"\")","v":""},null,{"$f":"IF(P189=TRUE,CONCATENATE(Debts!B28,\" - \",Debts!N28),\"\")","v":""}]
[null,{"$f":"Debts!A29","v":115},{"$f":"Debts!B29","v":0},null,{"$f":"Debts!D29","v":0},{"$f":"Debts!F29","v":0},{"$f":"Debts!H29","v":"M"},0,null,null,null,null,null,null,null,{"$f":"Debts!L29","v":false},{"$f":"IF(P190=TRUE,CONCATENATE(Debts!$B$3,\"/\",Debts!B29,\"/\",Debts!N29),\"\")","v":""},null,{"$f":"IF(P190=TRUE,CONCATENATE(Debts!B29,\" - \",Debts!N29),\"\")","v":""}]
[null,{"$f":"Debts!A30","v":116},{"$f":"Debts!B30","v":0},null,{"$f":"Debts!D30","v":0},{"$f":"Debts!F30","v":0},{"$f":"Debts!H30","v":"M"},0,null,null,null,null,null,null,null,{"$f":"Debts!L30","v":false},{"$f":"IF(P191=TRUE,CONCATENATE(Debts!$B$3,\"/\",Debts!B30,\"/\",Debts!N30),\"\")","v":""},null,{"$f":"IF(P191=TRUE,CONCATENATE(Debts!B30,\" - \",Debts!N30),\"\")","v":""}]
[null,{"$f":"Debts!A31","v":117},{"$f":"Debts!B31","v":0},null,{"$f":"Debts!D31","v":0},{"$f":"Debts!F31","v":0},{"$f":"Debts!H31","v":"M"},0,null,null,null,null,null,null,null,{"$f":"Debts!L31","v":false},{"$f":"IF(P192=TRUE,CONCATENATE(Debts!$B$3,\"/\",Debts!B31,\"/\",Debts!N31),\"\")","v":""},null,{"$f":"IF(P192=TRUE,CONCATENATE(Debts!B31,\" - \",Debts!N31),\"\")","v":""}]
[null,{"$f":"Debts!A32","v":118},{"$f":"Debts!B32","v":0},null,{"$f":"Debts!D32","v":0},{"$f":"Debts!F32","v":0},{"$f":"Debts!H32","v":"M"},0,null,null,null,null,null,null,null,{"$f":"Debts!L32","v":false},{"$f":"IF(P193=TRUE,CONCATENATE(Debts!$B$3,\"/\",Debts!B32,\"/\",Debts!N32),\"\")","v":""},null,{"$f":"IF(P193=TRUE,CONCATENATE(Debts!B32,\" - \",Debts!N32),\"\")","v":""}]
[null,{"$f":"Debts!A33","v":119},{"$f":"Debts!B33","v":0},null,{"$f":"Debts!D33","v":0},{"$f":"Debts!F33","v":0},{"$f":"Debts!H33","v":"M"},0,null,null,null,null,null,null,null,{"$f":"Debts!L33","v":false},{"$f":"IF(P194=TRUE,CONCATENATE(Debts!$B$3,\"/\",Debts!B33,\"/\",Debts!N33),\"\")","v":""},null,{"$f":"IF(P194=TRUE,CONCATENATE(Debts!B33,\" - \",Debts!N33),\"\")","v":""}]
[null,{"$f":"Debts!A34","v":120},{"$f":"Debts!B34","v":0},null,{"$f":"Debts!D34","v":0},{"$f":"Debts!F34","v":0},{"$f":"Debts!H34","v":"M"},0,null,null,null,null,null,null,null,{"$f":"Debts!L34","v":false},{"$f":"IF(P195=TRUE,CONCATENATE(Debts!$B$3,\"/\",Debts!B34,\"/\",Debts!N34),\"\")","v":""},null,{"$f":"IF(P195=TRUE,CONCATENATE(Debts!B34,\" - \",Debts!N34),\"\")","v":""}]
[null,{"$f":"Debts!A35","v":121},{"$f":"Debts!B35","v":0},null,{"$f":"Debts!D35","v":0},{"$f":"Debts!F35","v":0},{"$f":"Debts!H35","v":"M"},0,null,null,null,null,null,null,null,{"$f":"Debts!L35","v":false},{"$f":"IF(P196=TRUE,CONCATENATE(Debts!$B$3,\"/\",Debts!B35,\"/\",Debts!N35),\"\")","v":""},null,{"$f":"IF(P196=TRUE,CONCATENATE(Debts!B35,\" - \",Debts!N35),\"\")","v":""}]
[null,{"$f":"Debts!A36","v":122},{"$f":"Debts!B36","v":0},null,{"$f":"Debts!D36","v":0},{"$f":"Debts!F36","v":0},{"$f":"Debts!H36","v":"M"},0,null,null,null,null,null,null,null,{"$f":"Debts!L36","v":false},{"$f":"IF(P197=TRUE,CONCATENATE(Debts!$B$3,\"/\",Debts!B36,\"/\",Debts!N36),\"\")","v":""},null,{"$f":"IF(P197=TRUE,CONCATENATE(Debts!B36,\" - \",Debts!N36),\"\")","v":""}]
[null,{"$f":"Debts!A37","v":123},{"$f":"Debts!B37","v":0},null,{"$f":"Debts!D37","v":0},{"$f":"Debts!F37","v":0},{"$f":"Debts!H37","v":"M"},0,null,null,null,null,null,null,null,{"$f":"Debts!L37","v":false},{"$f":"IF(P198=TRUE,CONCATENATE(Debts!$B$3,\"/\",Debts!B37,\"/\",Debts!N37),\"\")","v":""},null,{"$f":"IF(P198=TRUE,CONCATENATE(Debts!B37,\" - \",Debts!N37),\"\")","v":""}]
[null,{"$f":"Debts!A38","v":124},{"$f":"Debts!B38","v":0},null,{"$f":"Debts!D38","v":0},{"$f":"Debts!F38","v":0},{"$f":"Debts!H38","v":"M"},0,null,null,null,null,null,null,null,{"$f":"Debts!L38","v":false},{"$f":"IF(P199=TRUE,CONCATENATE(Debts!$B$3,\"/\",Debts!B38,\"/\",Debts!N38),\"\")","v":""},null,{"$f":"IF(P199=TRUE,CONCATENATE(Debts!B38,\" - \",Debts!N38),\"\")","v":""}]
[null,{"$f":"Debts!A39","v":125},{"$f":"Debts!B39","v":0},null,{"$f":"Debts!D39","v":0},{"$f":"Debts!F39","v":0},{"$f":"Debts!H39","v":"M"},0,null,null,null,null,null,null,null,{"$f":"Debts!L39","v":false},{"$f":"IF(P200=TRUE,CONCATENATE(Debts!$B$3,\"/\",Debts!B39,\"/\",Debts!N39),\"\")","v":""},null,{"$f":"IF(P200=TRUE,CONCATENATE(Debts!B39,\" - \",Debts!N39),\"\")","v":""}]
[null,{"$f":"Debts!A40","v":126},{"$f":"Debts!B40","v":0},null,{"$f":"Debts!D40","v":0},{"$f":"Debts!F40","v":0},{"$f":"Debts!H40","v":"M"},0,null,null,null,null,null,null,null,{"$f":"Debts!L40","v":false},{"$f":"IF(P201=TRUE,CONCATENATE(Debts!$B$3,\"/\",Debts!B40,\"/\",Debts!N40),\"\")","v":""},null,{"$f":"IF(P201=TRUE,CONCATENATE(Debts!B40,\" - \",Debts!N40),\"\")","v":""}]
[null,{"$f":"Debts!A41","v":127},{"$f":"Debts!B41","v":0},null,{"$f":"Debts!D41","v":0},{"$f":"Debts!F41","v":0},{"$f":"Debts!H41","v":"M"},0,null,null,null,null,null,null,null,{"$f":"Debts!L41","v":false},{"$f":"IF(P202=TRUE,CONCATENATE(Debts!$B$3,\"/\",Debts!B41,\"/\",Debts!N41),\"\")","v":""},null,{"$f":"IF(P202=TRUE,CONCATENATE(Debts!B41,\" - \",Debts!N41),\"\")","v":""}]
[null,{"$f":"Debts!A42","v":128},{"$f":"Debts!B42","v":0},null,{"$f":"Debts!D42","v":0},{"$f":"Debts!F42","v":0},{"$f":"Debts!H42","v":"M"},0,null,null,null,null,null,null,null,{"$f":"Debts!L42","v":false},{"$f":"IF(P203=TRUE,CONCATENATE(Debts!$B$3,\"/\",Debts!B42,\"/\",Debts!N42),\"\")","v":""},null,{"$f":"IF(P203=TRUE,CONCATENATE(Debts!B42,\" - \",Debts!N42),\"\")","v":""}]
[null,{"$f":"Debts!A43","v":129},{"$f":"Debts!B43","v":0},null,{"$f":"Debts!D43","v":0},{"$f":"Debts!F43","v":0},{"$f":"Debts!H43","v":"M"},0,null,null,null,null,null,null,null,{"$f":"Debts!L43","v":false},{"$f":"IF(P204=TRUE,CONCATENATE(Debts!$B$3,\"/\",Debts!B43,\"/\",Debts!N43),\"\")","v":""},null,{"$f":"IF(P204=TRUE,CONCATENATE(Debts!B43,\" - \",Debts!N43),\"\")","v":""}]
[null,{"$f":"Debts!A44","v":130},{"$f":"Debts!B44","v":0},null,{"$f":"Debts!D44","v":0},{"$f":"Debts!F44","v":0},{"$f":"Debts!H44","v":"M"},0,null,null,null,null,null,null,null,{"$f":"Debts!L44","v":false},{"$f":"IF(P205=TRUE,CONCATENATE(Debts!$B$3,\"/\",Debts!B44,\"/\",Debts!N44),\"\")","v":""},null,{"$f":"IF(P205=TRUE,CONCATENATE(Debts!B44,\" - \",Debts!N44),\"\")","v":""}]
[null,{"$f":"Debts!A45","v":131},{"$f":"Debts!B45","v":0},null,{"$f":"Debts!D45","v":0},{"$f":"Debts!F45","v":0},{"$f":"Debts!H45","v":"M"},0,null,null,null,null,null,null,null,{"$f":"Debts!L45","v":false},{"$f":"IF(P206=TRUE,CONCATENATE(Debts!$B$3,\"/\",Debts!B45,\"/\",Debts!N45),\"\")","v":""},null,{"$f":"IF(P206=TRUE,CONCATENATE(Debts!B45,\" - \",Debts!N45),\"\")","v":""}]
[null,{"$f":"Debts!A46","v":132},{"$f":"Debts!B46","v":0},null,{"$f":"Debts!D46","v":0},{"$f":"Debts!F46","v":0},{"$f":"Debts!H46","v":"M"},0,null,null,null,null,null,null,null,{"$f":"Debts!L46","v":false},{"$f":"IF(P207=TRUE,CONCATENATE(Debts!$B$3,\"/\",Debts!B46,\"/\",Debts!N46),\"\")","v":""},null,{"$f":"IF(P207=TRUE,CONCATENATE(Debts!B46,\" - \",Debts!N46),\"\")","v":""}]
[null,{"$f":"Debts!A47","v":133},{"$f":"Debts!B47","v":0},null,{"$f":"Debts!D47","v":0},{"$f":"Debts!F47","v":0},{"$f":"Debts!H47","v":"M"},0,null,null,null,null,null,null,null,{"$f":"Debts!L47","v":false},{"$f":"IF(P208=TRUE,CONCATENATE(Debts!$B$3,\"/\",Debts!B47,\"/\",Debts!N47),\"\")","v":""},null,{"$f":"IF(P208=TRUE,CONCATENATE(Debts!B47,\" - \",Debts!N47),\"\")","v":""}]
[null,{"$f":"Debts!A48","v":134},{"$f":"Debts!B48","v":0},null,{"$f":"Debts!D48","v":0},{"$f":"Debts!F48","v":0},{"$f":"Debts!H48","v":"M"},0,null,null,null,null,null,null,null,{"$f":"Debts!L48","v":false},{"$f":"IF(P209=TRUE,CONCATENATE(Debts!$B$3,\"/\",Debts!B48,\"/\",Debts!N48),\"\")","v":""},null,{"$f":"IF(P209=TRUE,CONCATENATE(Debts!B48,\" - \",Debts!N48),\"\")","v":""}]
[null,{"$f":"Debts!A49","v":135},{"$f":"Debts!B49","v":0},null,{"$f":"Debts!D49","v":0},{"$f":"Debts!F49","v":0},{"$f":"Debts!H49","v":"M"},0,null,null,null,null,null,null,null,{"$f":"Debts!L49","v":false},{"$f":"IF(P210=TRUE,CONCATENATE(Debts!$B$3,\"/\",Debts!B49,\"/\",Debts!N49),\"\")","v":""},null,{"$f":"IF(P210=TRUE,CONCATENATE(Debts!B49,\" - \",Debts!N49),\"\")","v":""}]
[null,{"$f":"Debts!A50","v":136},{"$f":"Debts!B50","v":0},null,{"$f":"Debts!D50","v":0},{"$f":"Debts!F50","v":0},{"$f":"Debts!H50","v":"M"},0,null,null,null,null,null,null,null,{"$f":"Debts!L50","v":false},{"$f":"IF(P211=TRUE,CONCATENATE(Debts!$B$3,\"/\",Debts!B50,\"/\",Debts!N50),\"\")","v":""},null,{"$f":"IF(P211=TRUE,CONCATENATE(Debts!B50,\" - \",Debts!N50),\"\")","v":""}]
[null,{"$f":"Debts!A51","v":137},{"$f":"Debts!B51","v":0},null,{"$f":"Debts!D51","v":0},{"$f":"Debts!F51","v":0},{"$f":"Debts!H51","v":"M"},0,null,null,null,null,null,null,null,{"$f":"Debts!L51","v":false},{"$f":"IF(P212=TRUE,CONCATENATE(Debts!$B$3,\"/\",Debts!B51,\"/\",Debts!N51),\"\")","v":""},null,{"$f":"IF(P212=TRUE,CONCATENATE(Debts!B51,\" - \",Debts!N51),\"\")","v":""}]
[null,{"$f":"Debts!A52","v":138},{"$f":"Debts!B52","v":0},null,{"$f":"Debts!D52","v":0},{"$f":"Debts!F52","v":0},{"$f":"Debts!H52","v":"M"},0,null,null,null,null,null,null,null,{"$f":"Debts!L52","v":false},{"$f":"IF(P213=TRUE,CONCATENATE(Debts!$B$3,\"/\",Debts!B52,\"/\",Debts!N52),\"\")","v":""},null,{"$f":"IF(P213=TRUE,CONCATENATE(Debts!B52,\" - \",Debts!N52),\"\")","v":""}]
[null,{"$f":"Debts!A53","v":139},{"$f":"Debts!B53","v":0},null,{"$f":"Debts!D53","v":0},{"$f":"Debts!F53","v":0},{"$f":"Debts!H53","v":"M"},0,null,null,null,null,null,null,null,{"$f":"Debts!L53","v":false},{"$f":"IF(P214=TRUE,CONCATENATE(Debts!$B$3,\"/\",Debts!B53,\"/\",Debts!N53),\"\")","v":""},null,{"$f":"IF(P214=TRUE,CONCATENATE(Debts!B53,\" - \",Debts!N53),\"\")","v":""}]
[null,{"$f":"Debts!A54","v":140},{"$f":"Debts!B54","v":0},null,{"$f":"Debts!D54","v":0},{"$f":"Debts!F54","v":0},{"$f":"Debts!H54","v":"M"},0,null,null,null,null,null,null,null,{"$f":"Debts!L54","v":false},{"$f":"IF(P215=TRUE,CONCATENATE(Debts!$B$3,\"/\",Debts!B54,\"/\",Debts!N54),\"\")","v":""},null,{"$f":"IF(P215=TRUE,CONCATENATE(Debts!B54,\" - \",Debts!N54),\"\")","v":""}]
[null,{"$f":"Debts!A55","v":141},{"$f":"Debts!B55","v":0},null,{"$f":"Debts!D55","v":0},{"$f":"Debts!F55","v":0},{"$f":"Debts!H55","v":"M"},0,null,null,null,null,null,null,null,{"$f":"Debts!L55","v":false},{"$f":"IF(P216=TRUE,CONCATENATE(Debts!$B$3,\"/\",Debts!B55,\"/\",Debts!N55),\"\")","v":""},null,{"$f":"IF(P216=TRUE,CONCATENATE(Debts!B55,\" - \",Debts!N55),\"\")","v":""}]
[null,{"$f":"Debts!A56","v":142},{"$f":"Debts!B56","v":0},null,{"$f":"Debts!D56","v":0},{"$f":"Debts!F56","v":0},{"$f":"Debts!H56","v":"M"},0,null,null,null,null,null,null,null,{"$f":"Debts!L56","v":false},{"$f":"IF(P217=TRUE,CONCATENATE(Debts!$B$3,\"/\",Debts!B56,\"/\",Debts!N56),\"\")","v":""},null,{"$f":"IF(P217=TRUE,CONCATENATE(Debts!B56,\" - \",Debts!N56),\"\")","v":""}]
[null,{"$f":"Debts!A57","v":143},{"$f":"Debts!B57","v":0},null,{"$f":"Debts!D57","v":0},{"$f":"Debts!F57","v":0},{"$f":"Debts!H57","v":"M"},0,null,null,null,null,null,null,null,{"$f":"Debts!L57","v":false},{"$f":"IF(P218=TRUE,CONCATENATE(Debts!$B$3,\"/\",Debts!B57,\"/\",Debts!N57),\"\")","v":""},null,{"$f":"IF(P218=TRUE,CONCATENATE(Debts!B57,\" - \",Debts!N57),\"\")","v":""}]
[null,{"$f":"Debts!A58","v":144},{"$f":"Debts!B58","v":0},null,{"$f":"Debts!D58","v":0},{"$f":"Debts!F58","v":0},{"$f":"Debts!H58","v":"M"},0,null,null,null,null,null,null,null,{"$f":"Debts!L58","v":false},{"$f":"IF(P219=TRUE,CONCATENATE(Debts!$B$3,\"/\",Debts!B58,\"/\",Debts!N58),\"\")","v":""},null,{"$f":"IF(P219=TRUE,CONCATENATE(Debts!B58,\" - \",Debts!N58),\"\")","v":""}]
[null,{"$f":"Debts!A59","v":145},{"$f":"Debts!B59","v":0},null,{"$f":"Debts!D59","v":0},{"$f":"Debts!F59","v":0},{"$f":"Debts!H59","v":"M"},0,null,null,null,null,null,null,null,{"$f":"Debts!L59","v":false},{"$f":"IF(P220=TRUE,CONCATENATE(Debts!$B$3,\"/\",Debts!B59,\"/\",Debts!N59),\"\")","v":""},null,{"$f":"IF(P220=TRUE,CONCATENATE(Debts!B59,\" - \",Debts!N59),\"\")","v":""}]
[null,{"$f":"Debts!A60","v":146},{"$f":"Debts!B60","v":0},null,{"$f":"Debts!D60","v":0},{"$f":"Debts!F60","v":0},{"$f":"Debts!H60","v":"M"},0,null,null,null,null,null,null,null,{"$f":"Debts!L60","v":false},{"$f":"IF(P221=TRUE,CONCATENATE(Debts!$B$3,\"/\",Debts!B60,\"/\",Debts!N60),\"\")","v":""},null,{"$f":"IF(P221=TRUE,CONCATENATE(Debts!B60,\" - \",Debts!N60),\"\")","v":""}]
[null,{"$f":"Debts!A61","v":147},{"$f":"Debts!B61","v":0},null,{"$f":"Debts!D61","v":0},{"$f":"Debts!F61","v":0},{"$f":"Debts!H61","v":"M"},0,null,null,null,null,null,null,null,{"$f":"Debts!L61","v":false},{"$f":"IF(P222=TRUE,CONCATENATE(Debts!$B$3,\"/\",Debts!B61,\"/\",Debts!N61),\"\")","v":""},null,{"$f":"IF(P222=TRUE,CONCATENATE(Debts!B61,\" - \",Debts!N61),\"\")","v":""}]
[null,{"$f":"Debts!A62","v":148},{"$f":"Debts!B62","v":0},null,{"$f":"Debts!D62","v":0},{"$f":"Debts!F62","v":0},{"$f":"Debts!H62","v":"M"},0,null,null,null,null,null,null,null,{"$f":"Debts!L62","v":false},{"$f":"IF(P223=TRUE,CONCATENATE(Debts!$B$3,\"/\",Debts!B62,\"/\",Debts!N62),\"\")","v":""},null,{"$f":"IF(P223=TRUE,CONCATENATE(Debts!B62,\" - \",Debts!N62),\"\")","v":""}]
[null,{"$f":"Debts!A63","v":149},{"$f":"Debts!B63","v":0},null,{"$f":"Debts!D63","v":0},{"$f":"Debts!F63","v":0},{"$f":"Debts!H63","v":"M"},0,null,null,null,null,null,null,null,{"$f":"Debts!L63","v":false},{"$f":"IF(P224=TRUE,CONCATENATE(Debts!$B$3,\"/\",Debts!B63,\"/\",Debts!N63),\"\")","v":""},null,{"$f":"IF(P224=TRUE,CONCATENATE(Debts!B63,\" - \",Debts!N63),\"\")","v":""}]
[null,{"$f":"Debts!A64","v":150},{"$f":"Debts!B64","v":0},null,{"$f":"Debts!D64","v":0},{"$f":"Debts!F64","v":0},{"$f":"Debts!H64","v":"M"},0,null,null,null,null,null,null,null,{"$f":"Debts!L64","v":false},{"$f":"IF(P225=TRUE,CONCATENATE(Debts!$B$3,\"/\",Debts!B64,\"/\",Debts!N64),\"\")","v":""},null,{"$f":"IF(P225=TRUE,CONCATENATE(Debts!B64,\" - \",Debts!N64),\"\")","v":""}]
[null,{"$f":"Debts!A65","v":151},{"$f":"Debts!B65","v":0},null,{"$f":"Debts!D65","v":0},{"$f":"Debts!F65","v":0},{"$f":"Debts!H65","v":"M"},0,null,null,null,null,null,null,null,{"$f":"Debts!L65","v":false},{"$f":"IF(P226=TRUE,CONCATENATE(Debts!$B$3,\"/\",Debts!B65,\"/\",Debts!N65),\"\")","v":""},null,{"$f":"IF(P226=TRUE,CONCATENATE(Debts!B65,\" - \",Debts!N65),\"\")","v":""}]
[null,{"$f":"Debts!A66","v":152},{"$f":"Debts!B66","v":0},null,{"$f":"Debts!D66","v":0},{"$f":"Debts!F66","v":0},{"$f":"Debts!H66","v":"M"},0,null,null,null,null,null,null,null,{"$f":"Debts!L66","v":false},{"$f":"IF(P227=TRUE,CONCATENATE(Debts!$B$3,\"/\",Debts!B66,\"/\",Debts!N66),\"\")","v":""},null,{"$f":"IF(P227=TRUE,CONCATENATE(Debts!B66,\" - \",Debts!N66),\"\")","v":""}]
[null,{"$f":"Debts!A67","v":153},{"$f":"Debts!B67","v":0},null,{"$f":"Debts!D67","v":0},{"$f":"Debts!F67","v":0},{"$f":"Debts!H67","v":"M"},0,null,null,null,null,null,null,null,{"$f":"Debts!L67","v":false},{"$f":"IF(P228=TRUE,CONCATENATE(Debts!$B$3,\"/\",Debts!B67,\"/\",Debts!N67),\"\")","v":""},null,{"$f":"IF(P228=TRUE,CONCATENATE(Debts!B67,\" - \",Debts!N67),\"\")","v":""}]
[null,{"$f":"Debts!A68","v":154},{"$f":"Debts!B68","v":0},null,{"$f":"Debts!D68","v":0},{"$f":"Debts!F68","v":0},{"$f":"Debts!H68","v":"M"},0,null,null,null,null,null,null,null,{"$f":"Debts!L68","v":false},{"$f":"IF(P229=TRUE,CONCATENATE(Debts!$B$3,\"/\",Debts!B68,\"/\",Debts!N68),\"\")","v":""},null,{"$f":"IF(P229=TRUE,CONCATENATE(Debts!B68,\" - \",Debts!N68),\"\")","v":""}]
[null,{"$f":"Debts!A69","v":155},{"$f":"Debts!B69","v":0},null,{"$f":"Debts!D69","v":0},{"$f":"Debts!F69","v":0},{"$f":"Debts!H69","v":"M"},0,null,null,null,null,null,null,null,{"$f":"Debts!L69","v":false},{"$f":"IF(P230=TRUE,CONCATENATE(Debts!$B$3,\"/\",Debts!B69,\"/\",Debts!N69),\"\")","v":""},null,{"$f":"IF(P230=TRUE,CONCATENATE(Debts!B69,\" - \",Debts!N69),\"\")","v":""}]
[null,{"$f":"Debts!A70","v":156},{"$f":"Debts!B70","v":0},null,{"$f":"Debts!D70","v":0},{"$f":"Debts!F70","v":0},{"$f":"Debts!H70","v":"M"},{"$f":"IF(G231=\"W\",F231*52/12,IF(OR(G231=\"M\",LEN(G231)=0),F231,IF(G231=\"Q\",F231/3,IF(G231=\"F\",F231*26/12,IF(OR(G231=\"A\",G231=\"Y\"),F231/12,F231)))))","v":0},null,null,null,null,null,null,null,{"$f":"Debts!L70","v":false},{"$f":"IF(P231=TRUE,CONCATENATE(Debts!$B$3,\"/\",Debts!B70,\"/\",Debts!N70),\"\")","v":""},null,{"$f":"IF(P231=TRUE,CONCATENATE(Debts!B70,\" - \",Debts!N70),\"\")","v":""}]
[null,{"$f":"Debts!A71","v":157},{"$f":"Debts!B71","v":0},null,{"$f":"Debts!D71","v":0},{"$f":"Debts!F71","v":0},{"$f":"Debts!H71","v":"M"},0,null,null,null,null,null,null,null,{"$f":"Debts!L71","v":false},{"$f":"IF(P232=TRUE,CONCATENATE(Debts!$B$3,\"/\",Debts!B71,\"/\",Debts!N71),\"\")","v":""},null,{"$f":"IF(P232=TRUE,CONCATENATE(Debts!B71,\" - \",Debts!N71),\"\")","v":""}]
[null,{"$f":"Debts!A72","v":158},{"$f":"Debts!B72","v":0},null,{"$f":"Debts!D72","v":0},{"$f":"Debts!F72","v":0},{"$f":"Debts!H72","v":"M"},0,null,null,null,null,null,null,null,{"$f":"Debts!L72","v":false},{"$f":"IF(P233=TRUE,CONCATENATE(Debts!$B$3,\"/\",Debts!B72,\"/\",Debts!N72),\"\")","v":""},null,{"$f":"IF(P233=TRUE,CONCATENATE(Debts!B72,\" - \",Debts!N72),\"\")","v":""}]
[null,{"$f":"Debts!A73","v":159},{"$f":"Debts!B73","v":0},null,{"$f":"Debts!D73","v":0},{"$f":"Debts!F73","v":0},{"$f":"Debts!H73","v":"M"},0,null,null,null,null,null,null,null,{"$f":"Debts!L73","v":false},{"$f":"IF(P234=TRUE,CONCATENATE(Debts!$B$3,\"/\",Debts!B73,\"/\",Debts!N73),\"\")","v":""},null,{"$f":"IF(P234=TRUE,CONCATENATE(Debts!B73,\" - \",Debts!N73),\"\")","v":""}]
[null,{"$f":"Debts!A74","v":160},{"$f":"Debts!B74","v":0},null,{"$f":"Debts!D74","v":0},{"$f":"Debts!F74","v":0},{"$f":"Debts!H74","v":"M"},0,null,null,null,null,null,null,null,{"$f":"Debts!L74","v":false},{"$f":"IF(P235=TRUE,CONCATENATE(Debts!$B$3,\"/\",Debts!B74,\"/\",Debts!N74),\"\")","v":""},null,{"$f":"IF(P235=TRUE,CONCATENATE(Debts!B74,\" - \",Debts!N74),\"\")","v":""}]
[null,{"$f":"Debts!A75","v":161},{"$f":"Debts!B75","v":0},null,{"$f":"Debts!D75","v":0},{"$f":"Debts!F75","v":0},{"$f":"Debts!H75","v":"M"},0,null,null,null,null,null,null,null,{"$f":"Debts!L75","v":false},{"$f":"IF(P236=TRUE,CONCATENATE(Debts!$B$3,\"/\",Debts!B75,\"/\",Debts!N75),\"\")","v":""},null,{"$f":"IF(P236=TRUE,CONCATENATE(Debts!B75,\" - \",Debts!N75),\"\")","v":""}]
[null,{"$f":"Debts!A76","v":162},{"$f":"Debts!B76","v":0},null,{"$f":"Debts!D76","v":0},{"$f":"Debts!F76","v":0},{"$f":"Debts!H76","v":"M"},0,null,null,null,null,null,null,null,{"$f":"Debts!L76","v":false},{"$f":"IF(P237=TRUE,CONCATENATE(Debts!$B$3,\"/\",Debts!B76,\"/\",Debts!N76),\"\")","v":""},null,{"$f":"IF(P237=TRUE,CONCATENATE(Debts!B76,\" - \",Debts!N76),\"\")","v":""}]
[null,{"$f":"Debts!A77","v":163},{"$f":"Debts!B77","v":0},null,{"$f":"Debts!D77","v":0},{"$f":"Debts!F77","v":0},{"$f":"Debts!H77","v":"M"},0,null,null,null,null,null,null,null,{"$f":"Debts!L77","v":false},{"$f":"IF(P238=TRUE,CONCATENATE(Debts!$B$3,\"/\",Debts!B77,\"/\",Debts!N77),\"\")","v":""},null,{"$f":"IF(P238=TRUE,CONCATENATE(Debts!B77,\" - \",Debts!N77),\"\")","v":""}]
[null,{"$f":"Debts!A78","v":164},{"$f":"Debts!B78","v":0},null,{"$f":"Debts!D78","v":0},{"$f":"Debts!F78","v":0},{"$f":"Debts!H78","v":"M"},0,null,null,null,null,null,null,null,{"$f":"Debts!L78","v":false},{"$f":"IF(P239=TRUE,CONCATENATE(Debts!$B$3,\"/\",Debts!B78,\"/\",Debts!N78),\"\")","v":""},null,{"$f":"IF(P239=TRUE,CONCATENATE(Debts!B78,\" - \",Debts!N78),\"\")","v":""}]
[null,{"$f":"Debts!A79","v":165},{"$f":"Debts!B79","v":0},null,{"$f":"Debts!D79","v":0},{"$f":"Debts!F79","v":0},{"$f":"Debts!H79","v":"M"},0,null,null,null,null,null,null,null,{"$f":"Debts!L79","v":false},{"$f":"IF(P240=TRUE,CONCATENATE(Debts!$B$3,\"/\",Debts!B79,\"/\",Debts!N79),\"\")","v":""},null,{"$f":"IF(P240=TRUE,CONCATENATE(Debts!B79,\" - \",Debts!N79),\"\")","v":""}]
[null,{"$f":"Debts!A80","v":166},{"$f":"Debts!B80","v":0},null,{"$f":"Debts!D80","v":0},{"$f":"Debts!F80","v":0},{"$f":"Debts!H80","v":"M"},0,null,null,null,null,null,null,null,{"$f":"Debts!L80","v":false},{"$f":"IF(P241=TRUE,CONCATENATE(Debts!$B$3,\"/\",Debts!B80,\"/\",Debts!N80),\"\")","v":""},null,{"$f":"IF(P241=TRUE,CONCATENATE(Debts!B80,\" - \",Debts!N80),\"\")","v":""}]
[null,{"$f":"Debts!A81","v":167},{"$f":"Debts!B81","v":0},null,{"$f":"Debts!D81","v":0},{"$f":"Debts!F81","v":0},{"$f":"Debts!H81","v":"M"},0,null,null,null,null,null,null,null,{"$f":"Debts!L81","v":false},{"$f":"IF(P242=TRUE,CONCATENATE(Debts!$B$3,\"/\",Debts!B81,\"/\",Debts!N81),\"\")","v":""},null,{"$f":"IF(P242=TRUE,CONCATENATE(Debts!B81,\" - \",Debts!N81),\"\")","v":""}]
[null,{"$f":"Debts!A82","v":168},{"$f":"Debts!B82","v":0},null,{"$f":"Debts!D82","v":0},{"$f":"Debts!F82","v":0},{"$f":"Debts!H82","v":"M"},0,null,null,null,null,null,null,null,{"$f":"Debts!L82","v":false},{"$f":"IF(P243=TRUE,CONCATENATE(Debts!$B$3,\"/\",Debts!B82,\"/\",Debts!N82),\"\")","v":""},null,{"$f":"IF(P243=TRUE,CONCATENATE(Debts!B82,\" - \",Debts!N82),\"\")","v":""}]
[null,{"$f":"Debts!A83","v":169},{"$f":"Debts!B83","v":0},null,{"$f":"Debts!D83","v":0},{"$f":"Debts!F83","v":0},{"$f":"Debts!H83","v":"M"},0,null,null,null,null,null,null,null,{"$f":"Debts!L83","v":false},{"$f":"IF(P244=TRUE,CONCATENATE(Debts!$B$3,\"/\",Debts!B83,\"/\",Debts!N83),\"\")","v":""},null,{"$f":"IF(P244=TRUE,CONCATENATE(Debts!B83,\" - \",Debts!N83),\"\")","v":""}]
[null,{"$f":"Debts!A84","v":170},{"$f":"Debts!B84","v":0},null,{"$f":"Debts!D84","v":0},{"$f":"Debts!F84","v":0},{"$f":"Debts!H84","v":"M"},0,null,null,null,null,null,null,null,{"$f":"Debts!L84","v":false},{"$f":"IF(P245=TRUE,CONCATENATE(Debts!$B$3,\"/\",Debts!B84,\"/\",Debts!N84),\"\")","v":""},null,{"$f":"IF(P245=TRUE,CONCATENATE(Debts!B84,\" - \",Debts!N84),\"\")","v":""}]
[null,{"$f":"Debts!A85","v":171},{"$f":"Debts!B85","v":0},null,{"$f":"Debts!D85","v":0},{"$f":"Debts!F85","v":0},{"$f":"Debts!H85","v":"M"},0,null,null,null,null,null,null,null,{"$f":"Debts!L85","v":false},{"$f":"IF(P246=TRUE,CONCATENATE(Debts!$B$3,\"/\",Debts!B85,\"/\",Debts!N85),\"\")","v":""},null,{"$f":"IF(P246=TRUE,CONCATENATE(Debts!B85,\" - \",Debts!N85),\"\")","v":""}]
[null,{"$f":"Debts!A86","v":172},{"$f":"Debts!B86","v":0},null,{"$f":"Debts!D86","v":0},{"$f":"Debts!F86","v":0},{"$f":"Debts!H86","v":"M"},0,null,null,null,null,null,null,null,{"$f":"Debts!L86","v":false},{"$f":"IF(P247=TRUE,CONCATENATE(Debts!$B$3,\"/\",Debts!B86,\"/\",Debts!N86),\"\")","v":""},null,{"$f":"IF(P247=TRUE,CONCATENATE(Debts!B86,\" - \",Debts!N86),\"\")","v":""}]
[null,{"$f":"Debts!A87","v":173},{"$f":"Debts!B87","v":0},null,{"$f":"Debts!D87","v":0},{"$f":"Debts!F87","v":0},{"$f":"Debts!H87","v":"M"},0,null,null,null,null,null,null,null,{"$f":"Debts!L87","v":false},{"$f":"IF(P248=TRUE,CONCATENATE(Debts!$B$3,\"/\",Debts!B87,\"/\",Debts!N87),\"\")","v":""},null,{"$f":"IF(P248=TRUE,CONCATENATE(Debts!B87,\" - \",Debts!N87),\"\")","v":""}]
[null,{"$f":"Debts!A88","v":174},{"$f":"Debts!B88","v":0},null,{"$f":"Debts!D88","v":0},{"$f":"Debts!F88","v":0},{"$f":"Debts!H88","v":"M"},0,null,null,null,null,null,null,null,{"$f":"Debts!L88","v":false},{"$f":"IF(P249=TRUE,CONCATENATE(Debts!$B$3,\"/\",Debts!B88,\"/\",Debts!N88),\"\")","v":""},null,{"$f":"IF(P249=TRUE,CONCATENATE(Debts!B88,\" - \",Debts!N88),\"\")","v":""}]
[null,{"$f":"Debts!A89","v":175},{"$f":"Debts!B89","v":0},null,{"$f":"Debts!D89","v":0},{"$f":"Debts!F89","v":0},{"$f":"Debts!H89","v":"M"},0,null,null,null,null,null,null,null,{"$f":"Debts!L89","v":false},{"$f":"IF(P250=TRUE,CONCATENATE(Debts!$B$3,\"/\",Debts!B89,\"/\",Debts!N89),\"\")","v":""},null,{"$f":"IF(P250=TRUE,CONCATENATE(Debts!B89,\" - \",Debts!N89),\"\")","v":""}]
[null,{"$f":"Debts!A90","v":176},{"$f":"Debts!B90","v":0},null,{"$f":"Debts!D90","v":0},{"$f":"Debts!F90","v":0},{"$f":"Debts!H90","v":"M"},0,null,null,null,null,null,null,null,{"$f":"Debts!L90","v":false},{"$f":"IF(P251=TRUE,CONCATENATE(Debts!$B$3,\"/\",Debts!B90,\"/\",Debts!N90),\"\")","v":""},null,{"$f":"IF(P251=TRUE,CONCATENATE(Debts!B90,\" - \",Debts!N90),\"\")","v":""}]
[null,{"$f":"Debts!A91","v":177},{"$f":"Debts!B91","v":0},null,{"$f":"Debts!D91","v":0},{"$f":"Debts!F91","v":0},{"$f":"Debts!H91","v":"M"},0,null,null,null,null,null,null,null,{"$f":"Debts!L91","v":false},{"$f":"IF(P252=TRUE,CONCATENATE(Debts!$B$3,\"/\",Debts!B91,\"/\",Debts!N91),\"\")","v":""},null,{"$f":"IF(P252=TRUE,CONCATENATE(Debts!B91,\" - \",Debts!N91),\"\")","v":""}]
[null,{"$f":"Debts!A92","v":178},{"$f":"Debts!B92","v":0},null,{"$f":"Debts!D92","v":0},{"$f":"Debts!F92","v":0},{"$f":"Debts!H92","v":"M"},0,null,null,null,null,null,null,null,{"$f":"Debts!L92","v":false},{"$f":"IF(P253=TRUE,CONCATENATE(Debts!$B$3,\"/\",Debts!B92,\"/\",Debts!N92),\"\")","v":""},null,{"$f":"IF(P253=TRUE,CONCATENATE(Debts!B92,\" - \",Debts!N92),\"\")","v":""}]
[null,{"$f":"Debts!A93","v":179},{"$f":"Debts!B93","v":0},null,{"$f":"Debts!D93","v":0},{"$f":"Debts!F93","v":0},{"$f":"Debts!H93","v":"M"},0,null,null,null,null,null,null,null,{"$f":"Debts!L93","v":false},{"$f":"IF(P254=TRUE,CONCATENATE(Debts!$B$3,\"/\",Debts!B93,\"/\",Debts!N93),\"\")","v":""},null,{"$f":"IF(P254=TRUE,CONCATENATE(Debts!B93,\" - \",Debts!N93),\"\")","v":""}]
[null,{"$f":"Debts!A94","v":180},{"$f":"Debts!B94","v":0},null,{"$f":"Debts!D94","v":0},{"$f":"Debts!F94","v":0},{"$f":"Debts!H94","v":"M"},0,null,null,null,null,null,null,null,{"$f":"Debts!L94","v":false},{"$f":"IF(P255=TRUE,CONCATENATE(Debts!$B$3,\"/\",Debts!B94,\"/\",Debts!N94),\"\")","v":""},null,{"$f":"IF(P255=TRUE,CONCATENATE(Debts!B94,\" - \",Debts!N94),\"\")","v":""}]
[null,{"$f":"Debts!A95","v":181},{"$f":"Debts!B95","v":0},null,{"$f":"Debts!D95","v":0},{"$f":"Debts!F95","v":0},{"$f":"Debts!H95","v":"M"},0,null,null,null,null,null,null,null,{"$f":"Debts!L95","v":false},{"$f":"IF(P256=TRUE,CONCATENATE(Debts!$B$3,\"/\",Debts!B95,\"/\",Debts!N95),\"\")","v":""},null,{"$f":"IF(P256=TRUE,CONCATENATE(Debts!B95,\" - \",Debts!N95),\"\")","v":""}]
[null,{"$f":"Debts!A96","v":182},{"$f":"Debts!B96","v":0},null,{"$f":"Debts!D96","v":0},{"$f":"Debts!F96","v":0},{"$f":"Debts!H96","v":"M"},0,null,null,null,null,null,null,null,{"$f":"Debts!L96","v":false},{"$f":"IF(P257=TRUE,CONCATENATE(Debts!$B$3,\"/\",Debts!B96,\"/\",Debts!N96),\"\")","v":""},null,{"$f":"IF(P257=TRUE,CONCATENATE(Debts!B96,\" - \",Debts!N96),\"\")","v":""}]
[null,{"$f":"Debts!A97","v":183},{"$f":"Debts!B97","v":0},null,{"$f":"Debts!D97","v":0},{"$f":"Debts!F97","v":0},{"$f":"Debts!H97","v":"M"},0,null,null,null,null,null,null,null,{"$f":"Debts!L97","v":false},{"$f":"IF(P258=TRUE,CONCATENATE(Debts!$B$3,\"/\",Debts!B97,\"/\",Debts!N97),\"\")","v":""},null,{"$f":"IF(P258=TRUE,CONCATENATE(Debts!B97,\" - \",Debts!N97),\"\")","v":""}]
[null,{"$f":"Debts!A98","v":184},{"$f":"Debts!B98","v":0},null,{"$f":"Debts!D98","v":0},{"$f":"Debts!F98","v":0},{"$f":"Debts!H98","v":"M"},0,null,null,null,null,null,null,null,{"$f":"Debts!L98","v":false},{"$f":"IF(P259=TRUE,CONCATENATE(Debts!$B$3,\"/\",Debts!B98,\"/\",Debts!N98),\"\")","v":""},null,{"$f":"IF(P259=TRUE,CONCATENATE(Debts!B98,\" - \",Debts!N98),\"\")","v":""}]
[null,{"$f":"Debts!A99","v":185},{"$f":"Debts!B99","v":0},null,{"$f":"Debts!D99","v":0},{"$f":"Debts!F99","v":0},{"$f":"Debts!H99","v":"M"},0,null,null,null,null,null,null,null,{"$f":"Debts!L99","v":false},{"$f":"IF(P260=TRUE,CONCATENATE(Debts!$B$3,\"/\",Debts!B99,\"/\",Debts!N99),\"\")","v":""},null,{"$f":"IF(P260=TRUE,CONCATENATE(Debts!B99,\" - \",Debts!N99),\"\")","v":""}]
[null,{"$f":"Debts!A100","v":186},{"$f":"Debts!B100","v":0},null,{"$f":"Debts!D100","v":0},{"$f":"Debts!F100","v":0},{"$f":"Debts!H100","v":"M"},0,null,null,null,null,null,null,null,{"$f":"Debts!L100","v":false},{"$f":"IF(P261=TRUE,CONCATENATE(Debts!$B$3,\"/\",Debts!B100,\"/\",Debts!N100),\"\")","v":""},null,{"$f":"IF(P261=TRUE,CONCATENATE(Debts!B100,\" - \",Debts!N100),\"\")","v":""}]
[null,{"$f":"Debts!A101","v":187},{"$f":"Debts!B101","v":0},null,{"$f":"Debts!D101","v":0},{"$f":"Debts!F101","v":0},{"$f":"Debts!H101","v":"M"},{"$f":"IF(G262=\"W\",F262*52/12,IF(OR(G262=\"M\",LEN(G262)=0),F262,IF(G262=\"Q\",F262/3,IF(G262=\"F\",F262*26/12,IF(OR(G262=\"A\",G262=\"Y\"),F262/12,F262)))))","v":0},null,null,null,null,null,null,null,{"$f":"Debts!L101","v":false},{"$f":"IF(P262=TRUE,CONCATENATE(Debts!$B$3,\"/\",Debts!B101,\"/\",Debts!N101),\"\")","v":""},null,{"$f":"IF(P262=TRUE,CONCATENATE(Debts!B101,\" - \",Debts!N101),\"\")","v":""}]
[null,null,"Total Priority Debts",null,{"$f":"SUM(E167:E262)","v":0},null,null,{"$f":"SUM(H167:H262)","v":0},null,null,null,null,null,null,null,{"$f":"IF(P166=TRUE,TRUE,FALSE)","v":false},"\"",null,{"$f":"Q263","v":"\""}]
[]
[]
[]
[null,"Non-Priority Debts\n","Creditor",null,"£ Owed","£ Repayment\nCurrent",null,"£ Monthly","Use on Fin\nStatement","CCJ","£ Repayment\nOffer Pro rata","£ Repayment\nOffer Rounded","£ Repayment\nOffer Minimum","£ Repayment\nOffer Token","£ Repayment\nOffer Final",{"$f":"IF(Q267=\"\",FALSE,TRUE)","v":false},{"$f":"IF(COUNTIF(P268:P363,TRUE)>0,B267,\"\")","v":""},null,{"$f":"IF(COUNTIF(P268:P363,TRUE)>0,Q267,\"\")","v":""}]
[null,{"$f":"Debts!A110","v":188},{"$f":"Debts!B110","v":0},null,{"$f":"Debts!D110","v":0},{"$f":"Debts!F110","v":""},{"$f":"Debts!H110","v":"M"},{"$f":"IF(G268=\"W\",F268*52/12,IF(OR(G268=\"M\",LEN(G268)=0),F268,IF(G268=\"Q\",F268/3,IF(G268=\"F\",F268*26/12,IF(OR(G268=\"A\",G268=\"Y\"),F268/12,F268)))))","v":""},{"$f":"Debts!L110","v":false},{"$f":"Debts!K110","v":false},{"$f":"IF( AND( $E$377 > 0, $I268 = FALSE ), E268 / $E$376 * $E$377, 0 )","v":0},{"$f":"IF( $E$381 > 0, INT( K268 ) + ROUND( ( K268 - INT( K268 ) ) / $E$381, 0 ) * $E$381, K268 )","v":0},{"$f":"IF( AND( $C268 <> 0, $E$379 > 0 ), MAX( $E$379, L268 ), L268)","v":0},{"$f":"IF( AND( $C268 <> 0, $E$380 > 0 ), $E$380, M268)","v":0},{"$f":"IF( $I268 = TRUE, H268, N268 )","v":0},{"$f":"Debts!O110","v":false},{"$f":"IF(P268=TRUE,CONCATENATE(Debts!$B$107,\"/\",Debts!B110,\"/\",Debts!N110),\"\")","v":""},null,{"$f":"IF(P268=TRUE,CONCATENATE(Debts!B110,\" - \",Debts!N110),\"\")","v":""}]
[null,{"$f":"Debts!A111","v":189},{"$f":"Debts!B111","v":0},null,{"$f":"Debts!D111","v":0},{"$f":"Debts!F112","v":""},{"$f":"Debts!H111","v":"M"},{"$f":"IF(G269=\"W\",F269*52/12,IF(OR(G269=\"M\",LEN(G269)=0),F269,IF(G269=\"Q\",F269/3,IF(G269=\"F\",F269*26/12,IF(OR(G269=\"A\",G269=\"Y\"),F269/12,F269)))))","v":""},{"$f":"Debts!L111","v":false},{"$f":"Debts!K111","v":false},0,{"$f":"IF( $E$381 > 0, INT( K269 ) + ROUND( ( K269 - INT( K269 ) ) / $E$381, 0 ) * $E$381, K269 )","v":0},0,0,{"$f":"IF( $I269 = TRUE, H269, N269 )","v":0},{"$f":"Debts!O111","v":false},{"$f":"IF(P269=TRUE,CONCATENATE(Debts!$B$107,\"/\",Debts!B111,\"/\",Debts!N111),\"\")","v":""},null,{"$f":"IF(P269=TRUE,CONCATENATE(Debts!B111,\" - \",Debts!N111),\"\")","v":""}]
[null,{"$f":"Debts!A112","v":190},{"$f":"Debts!B112","v":0},null,{"$f":"Debts!D112","v":0},{"$f":"Debts!F113","v":""},{"$f":"Debts!H112","v":"M"},"",{"$f":"Debts!L112","v":false},{"$f":"Debts!K112","v":false},0,0,0,0,0,{"$f":"Debts!O112","v":false},{"$f":"IF(P270=TRUE,CONCATENATE(Debts!$B$107,\"/\",Debts!B112,\"/\",Debts!N112),\"\")","v":""},null,{"$f":"IF(P270=TRUE,CONCATENATE(Debts!B112,\" - \",Debts!N112),\"\")","v":""}]
[null,{"$f":"Debts!A113","v":191},{"$f":"Debts!B113","v":0},null,{"$f":"Debts!D113","v":0},{"$f":"Debts!F114","v":""},{"$f":"Debts!H113","v":"M"},"",{"$f":"Debts!L113","v":false},{"$f":"Debts!K113","v":false},0,0,0,0,0,{"$f":"Debts!O113","v":false},{"$f":"IF(P271=TRUE,CONCATENATE(Debts!$B$107,\"/\",Debts!B113,\"/\",Debts!N113),\"\")","v":""},null,{"$f":"IF(P271=TRUE,CONCATENATE(Debts!B113,\" - \",Debts!N113),\"\")","v":""}]
[null,{"$f":"Debts!A114","v":192},{"$f":"Debts!B114","v":0},null,{"$f":"Debts!D114","v":0},{"$f":"Debts!F115","v":""},{"$f":"Debts!H114","v":"M"},"",{"$f":"Debts!L114","v":false},{"$f":"Debts!K114","v":false},0,0,0,0,0,{"$f":"Debts!O114","v":false},{"$f":"IF(P272=TRUE,CONCATENATE(Debts!$B$107,\"/\",Debts!B114,\"/\",Debts!N114),\"\")","v":""},null,{"$f":"IF(P272=TRUE,CONCATENATE(Debts!B114,\" - \",Debts!N114),\"\")","v":""}]
[null,{"$f":"Debts!A115","v":193},{"$f":"Debts!B115","v":0},null,{"$f":"Debts!D115","v":0},{"$f":"Debts!F116","v":""},{"$f":"Debts!H115","v":"M"},"",{"$f":"Debts!L115","v":false},{"$f":"Debts!K115","v":false},0,0,0,0,0,{"$f":"Debts!O115","v":false},{"$f":"IF(P273=TRUE,CONCATENATE(Debts!$B$107,\"/\",Debts!B115,\"/\",Debts!N115),\"\")","v":""},null,{"$f":"IF(P273=TRUE,CONCATENATE(Debts!B115,\" - \",Debts!N115),\"\")","v":""}]
[null,{"$f":"Debts!A116","v":194},{"$f":"Debts!B116","v":0},null,{"$f":"Debts!D116","v":0},{"$f":"Debts!F117","v":""},{"$f":"Debts!H116","v":"M"},"",{"$f":"Debts!L116","v":false},{"$f":"Debts!K116","v":false},0,0,0,0,0,{"$f":"Debts!O116","v":false},{"$f":"IF(P274=TRUE,CONCATENATE(Debts!$B$107,\"/\",Debts!B116,\"/\",Debts!N116),\"\")","v":""},null,{"$f":"IF(P274=TRUE,CONCATENATE(Debts!B116,\" - \",Debts!N116),\"\")","v":""}]
[null,{"$f":"Debts!A117","v":195},{"$f":"Debts!B117","v":0},null,{"$f":"Debts!D117","v":0},{"$f":"Debts!F118","v":""},{"$f":"Debts!H117","v":"M"},"",{"$f":"Debts!L117","v":false},{"$f":"Debts!K117","v":false},0,0,0,0,0,{"$f":"Debts!O117","v":false},{"$f":"IF(P275=TRUE,CONCATENATE(Debts!$B$107,\"/\",Debts!B117,\"/\",Debts!N117),\"\")","v":""},null,{"$f":"IF(P275=TRUE,CONCATENATE(Debts!B117,\" - \",Debts!N117),\"\")","v":""}]
[null,{"$f":"Debts!A118","v":196},{"$f":"Debts!B118","v":0},null,{"$f":"Debts!D118","v":0},{"$f":"Debts!F119","v":""},{"$f":"Debts!H118","v":"M"},"",{"$f":"Debts!L118","v":false},{"$f":"Debts!K118","v":false},0,0,0,0,0,{"$f":"Debts!O118","v":false},{"$f":"IF(P276=TRUE,CONCATENATE(Debts!$B$107,\"/\",Debts!B118,\"/\",Debts!N118),\"\")","v":""},null,{"$f":"IF(P276=TRUE,CONCATENATE(Debts!B118,\" - \",Debts!N118),\"\")","v":""}]
[null,{"$f":"Debts!A119","v":197},{"$f":"Debts!B119","v":0},null,{"$f":"Debts!D119","v":0},{"$f":"Debts!F120","v":""},{"$f":"Debts!H119","v":"M"},"",{"$f":"Debts!L119","v":false},{"$f":"Debts!K119","v":false},0,0,0,0,0,{"$f":"Debts!O119","v":false},{"$f":"IF(P277=TRUE,CONCATENATE(Debts!$B$107,\"/\",Debts!B119,\"/\",Debts!N119),\"\")","v":""},null,{"$f":"IF(P277=TRUE,CONCATENATE(Debts!B119,\" - \",Debts!N119),\"\")","v":""}]
[null,{"$f":"Debts!A120","v":198},{"$f":"Debts!B120","v":0},null,{"$f":"Debts!D120","v":0},{"$f":"Debts!F121","v":""},{"$f":"Debts!H120","v":"M"},"",{"$f":"Debts!L120","v":false},{"$f":"Debts!K120","v":false},0,0,0,0,0,{"$f":"Debts!O120","v":false},{"$f":"IF(P278=TRUE,CONCATENATE(Debts!$B$107,\"/\",Debts!B120,\"/\",Debts!N120),\"\")","v":""},null,{"$f":"IF(P278=TRUE,CONCATENATE(Debts!B120,\" - \",Debts!N120),\"\")","v":""}]
[null,{"$f":"Debts!A121","v":199},{"$f":"Debts!B121","v":0},null,{"$f":"Debts!D121","v":0},{"$f":"Debts!F122","v":""},{"$f":"Debts!H121","v":"M"},"",{"$f":"Debts!L121","v":false},{"$f":"Debts!K121","v":false},0,0,0,0,0,{"$f":"Debts!O121","v":false},{"$f":"IF(P279=TRUE,CONCATENATE(Debts!$B$107,\"/\",Debts!B121,\"/\",Debts!N121),\"\")","v":""},null,{"$f":"IF(P279=TRUE,CONCATENATE(Debts!B121,\" - \",Debts!N121),\"\")","v":""}]
[null,{"$f":"Debts!A122","v":200},{"$f":"Debts!B122","v":0},null,{"$f":"Debts!D122","v":0},{"$f":"Debts!F123","v":""},{"$f":"Debts!H122","v":"M"},"",{"$f":"Debts!L122","v":false},{"$f":"Debts!K122","v":false},0,0,0,0,0,{"$f":"Debts!O122","v":false},{"$f":"IF(P280=TRUE,CONCATENATE(Debts!$B$107,\"/\",Debts!B122,\"/\",Debts!N122),\"\")","v":""},null,{"$f":"IF(P280=TRUE,CONCATENATE(Debts!B122,\" - \",Debts!N122),\"\")","v":""}]
[null,{"$f":"Debts!A123","v":201},{"$f":"Debts!B123","v":0},null,{"$f":"Debts!D123","v":0},{"$f":"Debts!F124","v":""},{"$f":"Debts!H123","v":"M"},"",{"$f":"Debts!L123","v":false},{"$f":"Debts!K123","v":false},0,0,0,0,0,{"$f":"Debts!O123","v":false},{"$f":"IF(P281=TRUE,CONCATENATE(Debts!$B$107,\"/\",Debts!B123,\"/\",Debts!N123),\"\")","v":""},null,{"$f":"IF(P281=TRUE,CONCATENATE(Debts!B123,\" - \",Debts!N123),\"\")","v":""}]
[null,{"$f":"Debts!A124","v":202},{"$f":"Debts!B124","v":0},null,{"$f":"Debts!D124","v":0},{"$f":"Debts!F125","v":""},{"$f":"Debts!H124","v":"M"},"",{"$f":"Debts!L124","v":false},{"$f":"Debts!K124","v":false},0,0,0,0,0,{"$f":"Debts!O124","v":false},{"$f":"IF(P282=TRUE,CONCATENATE(Debts!$B$107,\"/\",Debts!B124,\"/\",Debts!N124),\"\")","v":""},null,{"$f":"IF(P282=TRUE,CONCATENATE(Debts!B124,\" - \",Debts!N124),\"\")","v":""}]
[null,{"$f":"Debts!A125","v":203},{"$f":"Debts!B125","v":0},null,{"$f":"Debts!D125","v":0},{"$f":"Debts!F126","v":""},{"$f":"Debts!H125","v":"M"},"",{"$f":"Debts!L125","v":false},{"$f":"Debts!K125","v":false},0,0,0,0,0,{"$f":"Debts!O125","v":false},{"$f":"IF(P283=TRUE,CONCATENATE(Debts!$B$107,\"/\",Debts!B125,\"/\",Debts!N125),\"\")","v":""},null,{"$f":"IF(P283=TRUE,CONCATENATE(Debts!B125,\" - \",Debts!N125),\"\")","v":""}]
[null,{"$f":"Debts!A126","v":204},{"$f":"Debts!B126","v":0},null,{"$f":"Debts!D126","v":0},{"$f":"Debts!F126","v":""},{"$f":"Debts!H126","v":"M"},"",{"$f":"Debts!L126","v":false},{"$f":"Debts!K126","v":false},0,0,0,0,0,{"$f":"Debts!O126","v":false},{"$f":"IF(P284=TRUE,CONCATENATE(Debts!$B$107,\"/\",Debts!B126,\"/\",Debts!N126),\"\")","v":""},null,{"$f":"IF(P284=TRUE,CONCATENATE(Debts!B126,\" - \",Debts!N126),\"\")","v":""}]
[null,{"$f":"Debts!A127","v":205},{"$f":"Debts!B127","v":0},null,{"$f":"Debts!D127","v":0},{"$f":"Debts!F127","v":""},{"$f":"Debts!H127","v":"M"},"",{"$f":"Debts!L127","v":false},{"$f":"Debts!K127","v":false},0,0,0,0,0,{"$f":"Debts!O127","v":false},{"$f":"IF(P285=TRUE,CONCATENATE(Debts!$B$107,\"/\",Debts!B127,\"/\",Debts!N127),\"\")","v":""},null,{"$f":"IF(P285=TRUE,CONCATENATE(Debts!B127,\" - \",Debts!N127),\"\")","v":""}]
[null,{"$f":"Debts!A128","v":206},{"$f":"Debts!B128","v":0},null,{"$f":"Debts!D128","v":0},{"$f":"Debts!F128","v":""},{"$f":"Debts!H128","v":"M"},"",{"$f":"Debts!L128","v":false},{"$f":"Debts!K128","v":false},0,0,0,0,0,{"$f":"Debts!O128","v":false},{"$f":"IF(P286=TRUE,CONCATENATE(Debts!$B$107,\"/\",Debts!B128,\"/\",Debts!N128),\"\")","v":""},null,{"$f":"IF(P286=TRUE,CONCATENATE(Debts!B128,\" - \",Debts!N128),\"\")","v":""}]
[null,{"$f":"Debts!A129","v":207},{"$f":"Debts!B129","v":0},null,{"$f":"Debts!D129","v":0},{"$f":"Debts!F129","v":""},{"$f":"Debts!H129","v":"M"},"",{"$f":"Debts!L129","v":false},{"$f":"Debts!K129","v":false},0,0,0,0,0,{"$f":"Debts!O129","v":false},{"$f":"IF(P287=TRUE,CONCATENATE(Debts!$B$107,\"/\",Debts!B129,\"/\",Debts!N129),\"\")","v":""},null,{"$f":"IF(P287=TRUE,CONCATENATE(Debts!B129,\" - \",Debts!N129),\"\")","v":""}]
[null,{"$f":"Debts!A130","v":208},{"$f":"Debts!B130","v":0},null,{"$f":"Debts!D130","v":0},{"$f":"Debts!F130","v":""},{"$f":"Debts!H130","v":"M"},"",{"$f":"Debts!L130","v":false},{"$f":"Debts!K130","v":false},0,0,0,0,0,{"$f":"Debts!O130","v":false},{"$f":"IF(P288=TRUE,CONCATENATE(Debts!$B$107,\"/\",Debts!B130,\"/\",Debts!N130),\"\")","v":""},null,{"$f":"IF(P288=TRUE,CONCATENATE(Debts!B130,\" - \",Debts!N130),\"\")","v":""}]
[null,{"$f":"Debts!A131","v":209},{"$f":"Debts!B131","v":0},null,{"$f":"Debts!D131","v":0},{"$f":"Debts!F131","v":""},{"$f":"Debts!H131","v":"M"},"",{"$f":"Debts!L131","v":false},{"$f":"Debts!K131","v":false},0,0,0,0,0,{"$f":"Debts!O131","v":false},{"$f":"IF(P289=TRUE,CONCATENATE(Debts!$B$107,\"/\",Debts!B131,\"/\",Debts!N131),\"\")","v":""},null,{"$f":"IF(P289=TRUE,CONCATENATE(Debts!B131,\" - \",Debts!N131),\"\")","v":""}]
[null,{"$f":"Debts!A132","v":210},{"$f":"Debts!B132","v":0},null,{"$f":"Debts!D132","v":0},{"$f":"Debts!F132","v":""},{"$f":"Debts!H132","v":"M"},"",{"$f":"Debts!L132","v":false},{"$f":"Debts!K132","v":false},0,0,0,0,0,{"$f":"Debts!O132","v":false},{"$f":"IF(P290=TRUE,CONCATENATE(Debts!$B$107,\"/\",Debts!B132,\"/\",Debts!N132),\"\")","v":""},null,{"$f":"IF(P290=TRUE,CONCATENATE(Debts!B132,\" - \",Debts!N132),\"\")","v":""}]
[null,{"$f":"Debts!A133","v":211},{"$f":"Debts!B133","v":0},null,{"$f":"Debts!D133","v":0},{"$f":"Debts!F133","v":""},{"$f":"Debts!H133","v":"M"},"",{"$f":"Debts!L133","v":false},{"$f":"Debts!K133","v":false},0,0,0,0,0,{"$f":"Debts!O133","v":false},{"$f":"IF(P291=TRUE,CONCATENATE(Debts!$B$107,\"/\",Debts!B133,\"/\",Debts!N133),\"\")","v":""},null,{"$f":"IF(P291=TRUE,CONCATENATE(Debts!B133,\" - \",Debts!N133),\"\")","v":""}]
[null,{"$f":"Debts!A134","v":212},{"$f":"Debts!B134","v":0},null,{"$f":"Debts!D134","v":0},{"$f":"Debts!F134","v":""},{"$f":"Debts!H134","v":"M"},"",{"$f":"Debts!L134","v":false},{"$f":"Debts!K134","v":false},0,0,0,0,0,{"$f":"Debts!O134","v":false},{"$f":"IF(P292=TRUE,CONCATENATE(Debts!$B$107,\"/\",Debts!B134,\"/\",Debts!N134),\"\")","v":""},null,{"$f":"IF(P292=TRUE,CONCATENATE(Debts!B134,\" - \",Debts!N134),\"\")","v":""}]
[null,{"$f":"Debts!A135","v":213},{"$f":"Debts!B135","v":0},null,{"$f":"Debts!D135","v":0},{"$f":"Debts!F135","v":""},{"$f":"Debts!H135","v":"M"},"",{"$f":"Debts!L135","v":false},{"$f":"Debts!K135","v":false},0,0,0,0,0,{"$f":"Debts!O135","v":false},{"$f":"IF(P293=TRUE,CONCATENATE(Debts!$B$107,\"/\",Debts!B135,\"/\",Debts!N135),\"\")","v":""},null,{"$f":"IF(P293=TRUE,CONCATENATE(Debts!B135,\" - \",Debts!N135),\"\")","v":""}]
[null,{"$f":"Debts!A136","v":214},{"$f":"Debts!B136","v":0},null,{"$f":"Debts!D136","v":0},{"$f":"Debts!F136","v":""},{"$f":"Debts!H136","v":"M"},"",{"$f":"Debts!L136","v":false},{"$f":"Debts!K136","v":false},0,0,0,0,0,{"$f":"Debts!O136","v":false},{"$f":"IF(P294=TRUE,CONCATENATE(Debts!$B$107,\"/\",Debts!B136,\"/\",Debts!N136),\"\")","v":""},null,{"$f":"IF(P294=TRUE,CONCATENATE(Debts!B136,\" - \",Debts!N136),\"\")","v":""}]
[null,{"$f":"Debts!A137","v":215},{"$f":"Debts!B137","v":0},null,{"$f":"Debts!D137","v":0},{"$f":"Debts!F137","v":""},{"$f":"Debts!H137","v":"M"},"",{"$f":"Debts!L137","v":false},{"$f":"Debts!K137","v":false},0,0,0,0,0,{"$f":"Debts!O137","v":false},{"$f":"IF(P295=TRUE,CONCATENATE(Debts!$B$107,\"/\",Debts!B137,\"/\",Debts!N137),\"\")","v":""},null,{"$f":"IF(P295=TRUE,CONCATENATE(Debts!B137,\" - \",Debts!N137),\"\")","v":""}]
[null,{"$f":"Debts!A138","v":216},{"$f":"Debts!B138","v":0},null,{"$f":"Debts!D138","v":0},{"$f":"Debts!F138","v":""},{"$f":"Debts!H138","v":"M"},"",{"$f":"Debts!L138","v":false},{"$f":"Debts!K138","v":false},0,0,0,0,0,{"$f":"Debts!O138","v":false},{"$f":"IF(P296=TRUE,CONCATENATE(Debts!$B$107,\"/\",Debts!B138,\"/\",Debts!N138),\"\")","v":""},null,{"$f":"IF(P296=TRUE,CONCATENATE(Debts!B138,\" - \",Debts!N138),\"\")","v":""}]
[null,{"$f":"Debts!A139","v":217},{"$f":"Debts!B139","v":0},null,{"$f":"Debts!D139","v":0},{"$f":"Debts!F139","v":""},{"$f":"Debts!H139","v":"M"},"",{"$f":"Debts!L139","v":false},{"$f":"Debts!K139","v":false},0,0,0,0,0,{"$f":"Debts!O139","v":false},{"$f":"IF(P297=TRUE,CONCATENATE(Debts!$B$107,\"/\",Debts!B139,\"/\",Debts!N139),\"\")","v":""},null,{"$f":"IF(P297=TRUE,CONCATENATE(Debts!B139,\" - \",Debts!N139),\"\")","v":""}]
[null,{"$f":"Debts!A140","v":218},{"$f":"Debts!B140","v":0},null,{"$f":"Debts!D140","v":0},{"$f":"Debts!F140","v":""},{"$f":"Debts!H140","v":"M"},"",{"$f":"Debts!L140","v":false},{"$f":"Debts!K140","v":false},0,0,0,0,0,{"$f":"Debts!O140","v":false},{"$f":"IF(P298=TRUE,CONCATENATE(Debts!$B$107,\"/\",Debts!B140,\"/\",Debts!N140),\"\")","v":""},null,{"$f":"IF(P298=TRUE,CONCATENATE(Debts!B140,\" - \",Debts!N140),\"\")","v":""}]
[null,{"$f":"Debts!A141","v":219},{"$f":"Debts!B141","v":0},null,{"$f":"Debts!D141","v":0},{"$f":"Debts!F141","v":""},{"$f":"Debts!H141","v":"M"},"",{"$f":"Debts!L141","v":false},{"$f":"Debts!K141","v":false},0,0,0,0,0,{"$f":"Debts!O141","v":false},{"$f":"IF(P299=TRUE,CONCATENATE(Debts!$B$107,\"/\",Debts!B141,\"/\",Debts!N141),\"\")","v":""},null,{"$f":"IF(P299=TRUE,CONCATENATE(Debts!B141,\" - \",Debts!N141),\"\")","v":""}]
[null,{"$f":"Debts!A142","v":220},{"$f":"Debts!B142","v":0},null,{"$f":"Debts!D142","v":0},{"$f":"Debts!F142","v":""},{"$f":"Debts!H142","v":"M"},"",{"$f":"Debts!L142","v":false},{"$f":"Debts!K142","v":false},{"$f":"IF( AND( $E$377 > 0, $I300 = FALSE ), E300 / $E$376 * $E$377, 0 )","v":0},0,{"$f":"IF( AND( $C300 <> 0, $E$379 > 0 ), MAX( $E$379, L300 ), L300)","v":0},{"$f":"IF( AND( $C300 <> 0, $E$380 > 0 ), $E$380, M300)","v":0},0,{"$f":"Debts!O142","v":false},{"$f":"IF(P300=TRUE,CONCATENATE(Debts!$B$107,\"/\",Debts!B142,\"/\",Debts!N142),\"\")","v":""},null,{"$f":"IF(P300=TRUE,CONCATENATE(Debts!B142,\" - \",Debts!N142),\"\")","v":""}]
[null,{"$f":"Debts!A143","v":221},{"$f":"Debts!B143","v":0},null,{"$f":"Debts!D143","v":0},{"$f":"Debts!F143","v":""},{"$f":"Debts!H143","v":"M"},"",{"$f":"Debts!L143","v":false},{"$f":"Debts!K143","v":false},0,0,0,0,0,{"$f":"Debts!O143","v":false},{"$f":"IF(P301=TRUE,CONCATENATE(Debts!$B$107,\"/\",Debts!B143,\"/\",Debts!N143),\"\")","v":""},null,{"$f":"IF(P301=TRUE,CONCATENATE(Debts!B143,\" - \",Debts!N143),\"\")","v":""}]
[null,{"$f":"Debts!A144","v":222},{"$f":"Debts!B144","v":0},null,{"$f":"Debts!D144","v":0},{"$f":"Debts!F144","v":""},{"$f":"Debts!H144","v":"M"},"",{"$f":"Debts!L144","v":false},{"$f":"Debts!K144","v":false},0,0,0,0,0,{"$f":"Debts!O144","v":false},{"$f":"IF(P302=TRUE,CONCATENATE(Debts!$B$107,\"/\",Debts!B144,\"/\",Debts!N144),\"\")","v":""},null,{"$f":"IF(P302=TRUE,CONCATENATE(Debts!B144,\" - \",Debts!N144),\"\")","v":""}]
[null,{"$f":"Debts!A145","v":223},{"$f":"Debts!B145","v":0},null,{"$f":"Debts!D145","v":0},{"$f":"Debts!F145","v":""},{"$f":"Debts!H145","v":"M"},"",{"$f":"Debts!L145","v":false},{"$f":"Debts!K145","v":false},0,0,0,0,0,{"$f":"Debts!O145","v":false},{"$f":"IF(P303=TRUE,CONCATENATE(Debts!$B$107,\"/\",Debts!B145,\"/\",Debts!N145),\"\")","v":""},null,{"$f":"IF(P303=TRUE,CONCATENATE(Debts!B145,\" - \",Debts!N145),\"\")","v":""}]
[null,{"$f":"Debts!A146","v":224},{"$f":"Debts!B146","v":0},null,{"$f":"Debts!D146","v":0},{"$f":"Debts!F146","v":""},{"$f":"Debts!H146","v":"M"},"",{"$f":"Debts!L146","v":false},{"$f":"Debts!K146","v":false},0,0,0,0,0,{"$f":"Debts!O146","v":false},{"$f":"IF(P304=TRUE,CONCATENATE(Debts!$B$107,\"/\",Debts!B146,\"/\",Debts!N146),\"\")","v":""},null,{"$f":"IF(P304=TRUE,CONCATENATE(Debts!B146,\" - \",Debts!N146),\"\")","v":""}]
[null,{"$f":"Debts!A147","v":225},{"$f":"Debts!B147","v":0},null,{"$f":"Debts!D147","v":0},{"$f":"Debts!F147","v":""},{"$f":"Debts!H147","v":"M"},"",{"$f":"Debts!L147","v":false},{"$f":"Debts!K147","v":false},0,{"$f":"IF( $E$381 > 0, INT( K305 ) + ROUND( ( K305 - INT( K305 ) ) / $E$381, 0 ) * $E$381, K305 )","v":0},0,0,{"$f":"IF( $I305 = TRUE, H305, N305 )","v":0},{"$f":"Debts!O147","v":false},{"$f":"IF(P305=TRUE,CONCATENATE(Debts!$B$107,\"/\",Debts!B147,\"/\",Debts!N147),\"\")","v":""},null,{"$f":"IF(P305=TRUE,CONCATENATE(Debts!B147,\" - \",Debts!N147),\"\")","v":""}]
[null,{"$f":"Debts!A148","v":226},{"$f":"Debts!B148","v":0},null,{"$f":"Debts!D148","v":0},{"$f":"Debts!F148","v":""},{"$f":"Debts!H148","v":"M"},"",{"$f":"Debts!L148","v":false},{"$f":"Debts!K148","v":false},0,0,0,0,0,{"$f":"Debts!O148","v":false},{"$f":"IF(P306=TRUE,CONCATENATE(Debts!$B$107,\"/\",Debts!B148,\"/\",Debts!N148),\"\")","v":""},null,{"$f":"IF(P306=TRUE,CONCATENATE(Debts!B148,\" - \",Debts!N148),\"\")","v":""}]
[null,{"$f":"Debts!A149","v":227},{"$f":"Debts!B149","v":0},null,{"$f":"Debts!D149","v":0},{"$f":"Debts!F149","v":""},{"$f":"Debts!H149","v":"M"},"",{"$f":"Debts!L149","v":false},{"$f":"Debts!K149","v":false},0,0,0,0,0,{"$f":"Debts!O149","v":false},{"$f":"IF(P307=TRUE,CONCATENATE(Debts!$B$107,\"/\",Debts!B149,\"/\",Debts!N149),\"\")","v":""},null,{"$f":"IF(P307=TRUE,CONCATENATE(Debts!B149,\" - \",Debts!N149),\"\")","v":""}]
[null,{"$f":"Debts!A150","v":228},{"$f":"Debts!B150","v":0},null,{"$f":"Debts!D150","v":0},{"$f":"Debts!F150","v":""},{"$f":"Debts!H150","v":"M"},"",{"$f":"Debts!L150","v":false},{"$f":"Debts!K150","v":false},0,0,0,0,0,{"$f":"Debts!O150","v":false},{"$f":"IF(P308=TRUE,CONCATENATE(Debts!$B$107,\"/\",Debts!B150,\"/\",Debts!N150),\"\")","v":""},null,{"$f":"IF(P308=TRUE,CONCATENATE(Debts!B150,\" - \",Debts!N150),\"\")","v":""}]
[null,{"$f":"Debts!A151","v":229},{"$f":"Debts!B151","v":0},null,{"$f":"Debts!D151","v":0},{"$f":"Debts!F151","v":""},{"$f":"Debts!H151","v":"M"},"",{"$f":"Debts!L151","v":false},{"$f":"Debts!K151","v":false},0,0,0,0,0,{"$f":"Debts!O151","v":false},{"$f":"IF(P309=TRUE,CONCATENATE(Debts!$B$107,\"/\",Debts!B151,\"/\",Debts!N151),\"\")","v":""},null,{"$f":"IF(P309=TRUE,CONCATENATE(Debts!B151,\" - \",Debts!N151),\"\")","v":""}]
[null,{"$f":"Debts!A152","v":230},{"$f":"Debts!B152","v":0},null,{"$f":"Debts!D152","v":0},{"$f":"Debts!F152","v":""},{"$f":"Debts!H152","v":"M"},"",{"$f":"Debts!L152","v":false},{"$f":"Debts!K152","v":false},0,0,0,0,0,{"$f":"Debts!O152","v":false},{"$f":"IF(P310=TRUE,CONCATENATE(Debts!$B$107,\"/\",Debts!B152,\"/\",Debts!N152),\"\")","v":""},null,{"$f":"IF(P310=TRUE,CONCATENATE(Debts!B152,\" - \",Debts!N152),\"\")","v":""}]
[null,{"$f":"Debts!A153","v":231},{"$f":"Debts!B153","v":0},null,{"$f":"Debts!D153","v":0},{"$f":"Debts!F153","v":""},{"$f":"Debts!H153","v":"M"},"",{"$f":"Debts!L153","v":false},{"$f":"Debts!K153","v":false},0,0,0,0,0,{"$f":"Debts!O153","v":false},{"$f":"IF(P311=TRUE,CONCATENATE(Debts!$B$107,\"/\",Debts!B153,\"/\",Debts!N153),\"\")","v":""},null,{"$f":"IF(P311=TRUE,CONCATENATE(Debts!B153,\" - \",Debts!N153),\"\")","v":""}]
[null,{"$f":"Debts!A154","v":232},{"$f":"Debts!B154","v":0},null,{"$f":"Debts!D154","v":0},{"$f":"Debts!F154","v":""},{"$f":"Debts!H154","v":"M"},"",{"$f":"Debts!L154","v":false},{"$f":"Debts!K154","v":false},0,0,0,0,0,{"$f":"Debts!O154","v":false},{"$f":"IF(P312=TRUE,CONCATENATE(Debts!$B$107,\"/\",Debts!B154,\"/\",Debts!N154),\"\")","v":""},null,{"$f":"IF(P312=TRUE,CONCATENATE(Debts!B154,\" - \",Debts!N154),\"\")","v":""}]
[null,{"$f":"Debts!A155","v":233},{"$f":"Debts!B155","v":0},null,{"$f":"Debts!D155","v":0},{"$f":"Debts!F155","v":""},{"$f":"Debts!H155","v":"M"},"",{"$f":"Debts!L155","v":false},{"$f":"Debts!K155","v":false},0,0,0,0,0,{"$f":"Debts!O155","v":false},{"$f":"IF(P313=TRUE,CONCATENATE(Debts!$B$107,\"/\",Debts!B155,\"/\",Debts!N155),\"\")","v":""},null,{"$f":"IF(P313=TRUE,CONCATENATE(Debts!B155,\" - \",Debts!N155),\"\")","v":""}]
[null,{"$f":"Debts!A156","v":234},{"$f":"Debts!B156","v":0},null,{"$f":"Debts!D156","v":0},{"$f":"Debts!F156","v":""},{"$f":"Debts!H156","v":"M"},"",{"$f":"Debts!L156","v":false},{"$f":"Debts!K156","v":false},0,0,0,0,0,{"$f":"Debts!O156","v":false},{"$f":"IF(P314=TRUE,CONCATENATE(Debts!$B$107,\"/\",Debts!B156,\"/\",Debts!N156),\"\")","v":""},null,{"$f":"IF(P314=TRUE,CONCATENATE(Debts!B156,\" - \",Debts!N156),\"\")","v":""}]
[null,{"$f":"Debts!A157","v":235},{"$f":"Debts!B157","v":0},null,{"$f":"Debts!D157","v":0},{"$f":"Debts!F157","v":""},{"$f":"Debts!H157","v":"M"},"",{"$f":"Debts!L157","v":false},{"$f":"Debts!K157","v":false},0,0,0,0,0,{"$f":"Debts!O157","v":false},{"$f":"IF(P315=TRUE,CONCATENATE(Debts!$B$107,\"/\",Debts!B157,\"/\",Debts!N157),\"\")","v":""},null,{"$f":"IF(P315=TRUE,CONCATENATE(Debts!B157,\" - \",Debts!N157),\"\")","v":""}]
[null,{"$f":"Debts!A158","v":236},{"$f":"Debts!B158","v":0},null,{"$f":"Debts!D158","v":0},{"$f":"Debts!F158","v":""},{"$f":"Debts!H158","v":"M"},"",{"$f":"Debts!L158","v":false},{"$f":"Debts!K158","v":false},0,0,0,0,0,{"$f":"Debts!O158","v":false},{"$f":"IF(P316=TRUE,CONCATENATE(Debts!$B$107,\"/\",Debts!B158,\"/\",Debts!N158),\"\")","v":""},null,{"$f":"IF(P316=TRUE,CONCATENATE(Debts!B158,\" - \",Debts!N158),\"\")","v":""}]
[null,{"$f":"Debts!A159","v":237},{"$f":"Debts!B159","v":0},null,{"$f":"Debts!D159","v":0},{"$f":"Debts!F159","v":""},{"$f":"Debts!H159","v":"M"},"",{"$f":"Debts!L159","v":false},{"$f":"Debts!K159","v":false},0,0,0,0,0,{"$f":"Debts!O159","v":false},{"$f":"IF(P317=TRUE,CONCATENATE(Debts!$B$107,\"/\",Debts!B159,\"/\",Debts!N159),\"\")","v":""},null,{"$f":"IF(P317=TRUE,CONCATENATE(Debts!B159,\" - \",Debts!N159),\"\")","v":""}]
[null,{"$f":"Debts!A160","v":238},{"$f":"Debts!B160","v":0},null,{"$f":"Debts!D160","v":0},{"$f":"Debts!F160","v":""},{"$f":"Debts!H160","v":"M"},"",{"$f":"Debts!L160","v":false},{"$f":"Debts!K160","v":false},0,0,0,0,0,{"$f":"Debts!O160","v":false},{"$f":"IF(P318=TRUE,CONCATENATE(Debts!$B$107,\"/\",Debts!B160,\"/\",Debts!N160),\"\")","v":""},null,{"$f":"IF(P318=TRUE,CONCATENATE(Debts!B160,\" - \",Debts!N160),\"\")","v":""}]
[null,{"$f":"Debts!A161","v":239},{"$f":"Debts!B161","v":0},null,{"$f":"Debts!D161","v":0},{"$f":"Debts!F161","v":""},{"$f":"Debts!H161","v":"M"},"",{"$f":"Debts!L161","v":false},{"$f":"Debts!K161","v":false},0,0,0,0,0,{"$f":"Debts!O161","v":false},{"$f":"IF(P319=TRUE,CONCATENATE(Debts!$B$107,\"/\",Debts!B161,\"/\",Debts!N161),\"\")","v":""},null,{"$f":"IF(P319=TRUE,CONCATENATE(Debts!B161,\" - \",Debts!N161),\"\")","v":""}]
[null,{"$f":"Debts!A162","v":240},{"$f":"Debts!B162","v":0},null,{"$f":"Debts!D162","v":0},{"$f":"Debts!F162","v":""},{"$f":"Debts!H162","v":"M"},"",{"$f":"Debts!L162","v":false},{"$f":"Debts!K162","v":false},0,0,0,0,0,{"$f":"Debts!O162","v":false},{"$f":"IF(P320=TRUE,CONCATENATE(Debts!$B$107,\"/\",Debts!B162,\"/\",Debts!N162),\"\")","v":""},null,{"$f":"IF(P320=TRUE,CONCATENATE(Debts!B162,\" - \",Debts!N162),\"\")","v":""}]
[null,{"$f":"Debts!A163","v":241},{"$f":"Debts!B163","v":0},null,{"$f":"Debts!D163","v":0},{"$f":"Debts!F163","v":""},{"$f":"Debts!H163","v":"M"},"",{"$f":"Debts!L163","v":false},{"$f":"Debts!K163","v":false},0,0,0,0,0,{"$f":"Debts!O163","v":false},{"$f":"IF(P321=TRUE,CONCATENATE(Debts!$B$107,\"/\",Debts!B163,\"/\",Debts!N163),\"\")","v":""},null,{"$f":"IF(P321=TRUE,CONCATENATE(Debts!B163,\" - \",Debts!N163),\"\")","v":""}]
[null,{"$f":"Debts!A164","v":242},{"$f":"Debts!B164","v":0},null,{"$f":"Debts!D164","v":0},{"$f":"Debts!F164","v":""},{"$f":"Debts!H164","v":"M"},"",{"$f":"Debts!L164","v":false},{"$f":"Debts!K164","v":false},0,0,0,0,0,{"$f":"Debts!O164","v":false},{"$f":"IF(P322=TRUE,CONCATENATE(Debts!$B$107,\"/\",Debts!B164,\"/\",Debts!N164),\"\")","v":""},null,{"$f":"IF(P322=TRUE,CONCATENATE(Debts!B164,\" - \",Debts!N164),\"\")","v":""}]
[null,{"$f":"Debts!A165","v":243},{"$f":"Debts!B165","v":0},null,{"$f":"Debts!D165","v":0},{"$f":"Debts!F165","v":""},{"$f":"Debts!H165","v":"M"},"",{"$f":"Debts!L165","v":false},{"$f":"Debts!K165","v":false},0,0,0,0,0,{"$f":"Debts!O165","v":false},{"$f":"IF(P323=TRUE,CONCATENATE(Debts!$B$107,\"/\",Debts!B165,\"/\",Debts!N165),\"\")","v":""},null,{"$f":"IF(P323=TRUE,CONCATENATE(Debts!B165,\" - \",Debts!N165),\"\")","v":""}]
[null,{"$f":"Debts!A166","v":244},{"$f":"Debts!B166","v":0},null,{"$f":"Debts!D166","v":0},{"$f":"Debts!F166","v":""},{"$f":"Debts!H166","v":"M"},"",{"$f":"Debts!L166","v":false},{"$f":"Debts!K166","v":false},0,0,0,0,0,{"$f":"Debts!O166","v":false},{"$f":"IF(P324=TRUE,CONCATENATE(Debts!$B$107,\"/\",Debts!B166,\"/\",Debts!N166),\"\")","v":""},null,{"$f":"IF(P324=TRUE,CONCATENATE(Debts!B166,\" - \",Debts!N166),\"\")","v":""}]
[null,{"$f":"Debts!A167","v":245},{"$f":"Debts!B167","v":0},null,{"$f":"Debts!D167","v":0},{"$f":"Debts!F167","v":""},{"$f":"Debts!H167","v":"M"},"",{"$f":"Debts!L167","v":false},{"$f":"Debts!K167","v":false},0,{"$f":"IF( $E$381 > 0, INT( K325 ) + ROUND( ( K325 - INT( K325 ) ) / $E$381, 0 ) * $E$381, K325 )","v":0},0,0,{"$f":"IF( $I325 = TRUE, H325, N325 )","v":0},{"$f":"Debts!O167","v":false},{"$f":"IF(P325=TRUE,CONCATENATE(Debts!$B$107,\"/\",Debts!B167,\"/\",Debts!N167),\"\")","v":""},null,{"$f":"IF(P325=TRUE,CONCATENATE(Debts!B167,\" - \",Debts!N167),\"\")","v":""}]
[null,{"$f":"Debts!A168","v":246},{"$f":"Debts!B168","v":0},null,{"$f":"Debts!D168","v":0},{"$f":"Debts!F168","v":""},{"$f":"Debts!H168","v":"M"},"",{"$f":"Debts!L168","v":false},{"$f":"Debts!K168","v":false},0,{"$f":"IF( $E$381 > 0, INT( K326 ) + ROUND( ( K326 - INT( K326 ) ) / $E$381, 0 ) * $E$381, K326 )","v":0},0,0,{"$f":"IF( $I326 = TRUE, H326, N326 )","v":0},{"$f":"Debts!O168","v":false},{"$f":"IF(P326=TRUE,CONCATENATE(Debts!$B$107,\"/\",Debts!B168,\"/\",Debts!N168),\"\")","v":""},null,{"$f":"IF(P326=TRUE,CONCATENATE(Debts!B168,\" - \",Debts!N168),\"\")","v":""}]
[null,{"$f":"Debts!A169","v":247},{"$f":"Debts!B169","v":0},null,{"$f":"Debts!D169","v":0},{"$f":"Debts!F169","v":""},{"$f":"Debts!H169","v":"M"},"",{"$f":"Debts!L169","v":false},{"$f":"Debts!K169","v":false},0,0,0,0,0,{"$f":"Debts!O169","v":false},{"$f":"IF(P327=TRUE,CONCATENATE(Debts!$B$107,\"/\",Debts!B169,\"/\",Debts!N169),\"\")","v":""},null,{"$f":"IF(P327=TRUE,CONCATENATE(Debts!B169,\" - \",Debts!N169),\"\")","v":""}]
[null,{"$f":"Debts!A170","v":248},{"$f":"Debts!B170","v":0},null,{"$f":"Debts!D170","v":0},{"$f":"Debts!F170","v":""},{"$f":"Debts!H170","v":"M"},"",{"$f":"Debts!L170","v":false},{"$f":"Debts!K170","v":false},0,0,0,0,0,{"$f":"Debts!O170","v":false},{"$f":"IF(P328=TRUE,CONCATENATE(Debts!$B$107,\"/\",Debts!B170,\"/\",Debts!N170),\"\")","v":""},null,{"$f":"IF(P328=TRUE,CONCATENATE(Debts!B170,\" - \",Debts!N170),\"\")","v":""}]
[null,{"$f":"Debts!A171","v":249},{"$f":"Debts!B171","v":0},null,{"$f":"Debts!D171","v":0},{"$f":"Debts!F171","v":""},{"$f":"Debts!H171","v":"M"},"",{"$f":"Debts!L171","v":false},{"$f":"Debts!K171","v":false},0,0,0,0,0,{"$f":"Debts!O171","v":false},{"$f":"IF(P329=TRUE,CONCATENATE(Debts!$B$107,\"/\",Debts!B171,\"/\",Debts!N171),\"\")","v":""},null,{"$f":"IF(P329=TRUE,CONCATENATE(Debts!B171,\" - \",Debts!N171),\"\")","v":""}]
[null,{"$f":"Debts!A172","v":250},{"$f":"Debts!B172","v":0},null,{"$f":"Debts!D172","v":0},{"$f":"Debts!F172","v":""},{"$f":"Debts!H172","v":"M"},"",{"$f":"Debts!L172","v":false},{"$f":"Debts!K172","v":false},0,0,0,0,0,{"$f":"Debts!O172","v":false},{"$f":"IF(P330=TRUE,CONCATENATE(Debts!$B$107,\"/\",Debts!B172,\"/\",Debts!N172),\"\")","v":""},null,{"$f":"IF(P330=TRUE,CONCATENATE(Debts!B172,\" - \",Debts!N172),\"\")","v":""}]
[null,{"$f":"Debts!A173","v":251},{"$f":"Debts!B173","v":0},null,{"$f":"Debts!D173","v":0},{"$f":"Debts!F173","v":""},{"$f":"Debts!H173","v":"M"},"",{"$f":"Debts!L173","v":false},{"$f":"Debts!K173","v":false},0,0,0,0,0,{"$f":"Debts!O173","v":false},{"$f":"IF(P331=TRUE,CONCATENATE(Debts!$B$107,\"/\",Debts!B173,\"/\",Debts!N173),\"\")","v":""},null,{"$f":"IF(P331=TRUE,CONCATENATE(Debts!B173,\" - \",Debts!N173),\"\")","v":""}]
[null,{"$f":"Debts!A174","v":252},{"$f":"Debts!B174","v":0},null,{"$f":"Debts!D174","v":0},{"$f":"Debts!F174","v":""},{"$f":"Debts!H174","v":"M"},"",{"$f":"Debts!L174","v":false},{"$f":"Debts!K174","v":false},{"$f":"IF( AND( $E$377 > 0, $I332 = FALSE ), E332 / $E$376 * $E$377, 0 )","v":0},0,{"$f":"IF( AND( $C332 <> 0, $E$379 > 0 ), MAX( $E$379, L332 ), L332)","v":0},{"$f":"IF( AND( $C332 <> 0, $E$380 > 0 ), $E$380, M332)","v":0},0,{"$f":"Debts!O174","v":false},{"$f":"IF(P332=TRUE,CONCATENATE(Debts!$B$107,\"/\",Debts!B174,\"/\",Debts!N174),\"\")","v":""},null,{"$f":"IF(P332=TRUE,CONCATENATE(Debts!B174,\" - \",Debts!N174),\"\")","v":""}]
[null,{"$f":"Debts!A175","v":253},{"$f":"Debts!B175","v":0},null,{"$f":"Debts!D175","v":0},{"$f":"Debts!F175","v":""},{"$f":"Debts!H175","v":"M"},{"$f":"IF(G333=\"W\",F333*52/12,IF(OR(G333=\"M\",LEN(G333)=0),F333,IF(G333=\"Q\",F333/3,IF(G333=\"F\",F333*26/12,IF(OR(G333=\"A\",G333=\"Y\"),F333/12,F333)))))","v":""},{"$f":"Debts!L175","v":false},{"$f":"Debts!K175","v":false},0,0,0,0,0,{"$f":"Debts!O175","v":false},{"$f":"IF(P333=TRUE,CONCATENATE(Debts!$B$107,\"/\",Debts!B175,\"/\",Debts!N175),\"\")","v":""},null,{"$f":"IF(P333=TRUE,CONCATENATE(Debts!B175,\" - \",Debts!N175),\"\")","v":""}]
[null,{"$f":"Debts!A176","v":254},{"$f":"Debts!B176","v":0},null,{"$f":"Debts!D176","v":0},{"$f":"Debts!F176","v":""},{"$f":"Debts!H176","v":"M"},"",{"$f":"Debts!L176","v":false},{"$f":"Debts!K176","v":false},0,0,0,0,0,{"$f":"Debts!O176","v":false},{"$f":"IF(P334=TRUE,CONCATENATE(Debts!$B$107,\"/\",Debts!B176,\"/\",Debts!N176),\"\")","v":""},null,{"$f":"IF(P334=TRUE,CONCATENATE(Debts!B176,\" - \",Debts!N176),\"\")","v":""}]
[null,{"$f":"Debts!A177","v":255},{"$f":"Debts!B177","v":0},null,{"$f":"Debts!D177","v":0},{"$f":"Debts!F177","v":""},{"$f":"Debts!H177","v":"M"},"",{"$f":"Debts!L177","v":false},{"$f":"Debts!K177","v":false},0,0,0,0,0,{"$f":"Debts!O177","v":false},{"$f":"IF(P335=TRUE,CONCATENATE(Debts!$B$107,\"/\",Debts!B177,\"/\",Debts!N177),\"\")","v":""},null,{"$f":"IF(P335=TRUE,CONCATENATE(Debts!B177,\" - \",Debts!N177),\"\")","v":""}]
[null,{"$f":"Debts!A178","v":256},{"$f":"Debts!B178","v":0},null,{"$f":"Debts!D178","v":0},{"$f":"Debts!F178","v":""},{"$f":"Debts!H178","v":"M"},"",{"$f":"Debts!L178","v":false},{"$f":"Debts!K178","v":false},0,0,0,0,0,{"$f":"Debts!O178","v":false},{"$f":"IF(P336=TRUE,CONCATENATE(Debts!$B$107,\"/\",Debts!B178,\"/\",Debts!N178),\"\")","v":""},null,{"$f":"IF(P336=TRUE,CONCATENATE(Debts!B178,\" - \",Debts!N178),\"\")","v":""}]
[null,{"$f":"Debts!A179","v":257},{"$f":"Debts!B179","v":0},null,{"$f":"Debts!D179","v":0},{"$f":"Debts!F179","v":""},{"$f":"Debts!H179","v":"M"},"",{"$f":"Debts!L179","v":false},{"$f":"Debts!K179","v":false},0,0,0,0,0,{"$f":"Debts!O179","v":false},{"$f":"IF(P337=TRUE,CONCATENATE(Debts!$B$107,\"/\",Debts!B179,\"/\",Debts!N179),\"\")","v":""},null,{"$f":"IF(P337=TRUE,CONCATENATE(Debts!B179,\" - \",Debts!N179),\"\")","v":""}]
[null,{"$f":"Debts!A180","v":258},{"$f":"Debts!B180","v":0},null,{"$f":"Debts!D180","v":0},{"$f":"Debts!F180","v":""},{"$f":"Debts!H180","v":"M"},"",{"$f":"Debts!L180","v":false},{"$f":"Debts!K180","v":false},0,0,0,0,0,{"$f":"Debts!O180","v":false},{"$f":"IF(P338=TRUE,CONCATENATE(Debts!$B$107,\"/\",Debts!B180,\"/\",Debts!N180),\"\")","v":""},null,{"$f":"IF(P338=TRUE,CONCATENATE(Debts!B180,\" - \",Debts!N180),\"\")","v":""}]
[null,{"$f":"Debts!A181","v":259},{"$f":"Debts!B181","v":0},null,{"$f":"Debts!D181","v":0},{"$f":"Debts!F181","v":""},{"$f":"Debts!H181","v":"M"},"",{"$f":"Debts!L181","v":false},{"$f":"Debts!K181","v":false},0,0,0,0,0,{"$f":"Debts!O181","v":false},{"$f":"IF(P339=TRUE,CONCATENATE(Debts!$B$107,\"/\",Debts!B181,\"/\",Debts!N181),\"\")","v":""},null,{"$f":"IF(P339=TRUE,CONCATENATE(Debts!B181,\" - \",Debts!N181),\"\")","v":""}]
[null,{"$f":"Debts!A182","v":260},{"$f":"Debts!B182","v":0},null,{"$f":"Debts!D182","v":0},{"$f":"Debts!F182","v":""},{"$f":"Debts!H182","v":"M"},"",{"$f":"Debts!L182","v":false},{"$f":"Debts!K182","v":false},0,0,0,0,0,{"$f":"Debts!O182","v":false},{"$f":"IF(P340=TRUE,CONCATENATE(Debts!$B$107,\"/\",Debts!B182,\"/\",Debts!N182),\"\")","v":""},null,{"$f":"IF(P340=TRUE,CONCATENATE(Debts!B182,\" - \",Debts!N182),\"\")","v":""}]
[null,{"$f":"Debts!A183","v":261},{"$f":"Debts!B183","v":0},null,{"$f":"Debts!D183","v":0},{"$f":"Debts!F183","v":""},{"$f":"Debts!H183","v":"M"},"",{"$f":"Debts!L183","v":false},{"$f":"Debts!K183","v":false},0,0,0,0,0,{"$f":"Debts!O183","v":false},{"$f":"IF(P341=TRUE,CONCATENATE(Debts!$B$107,\"/\",Debts!B183,\"/\",Debts!N183),\"\")","v":""},null,{"$f":"IF(P341=TRUE,CONCATENATE(Debts!B183,\" - \",Debts!N183),\"\")","v":""}]
[null,{"$f":"Debts!A184","v":262},{"$f":"Debts!B184","v":0},null,{"$f":"Debts!D184","v":0},{"$f":"Debts!F184","v":""},{"$f":"Debts!H184","v":"M"},"",{"$f":"Debts!L184","v":false},{"$f":"Debts!K184","v":false},0,0,0,0,0,{"$f":"Debts!O184","v":false},{"$f":"IF(P342=TRUE,CONCATENATE(Debts!$B$107,\"/\",Debts!B184,\"/\",Debts!N184),\"\")","v":""},null,{"$f":"IF(P342=TRUE,CONCATENATE(Debts!B184,\" - \",Debts!N184),\"\")","v":""}]
[null,{"$f":"Debts!A185","v":263},{"$f":"Debts!B185","v":0},null,{"$f":"Debts!D185","v":0},{"$f":"Debts!F185","v":""},{"$f":"Debts!H185","v":"M"},"",{"$f":"Debts!L185","v":false},{"$f":"Debts!K185","v":false},0,0,0,0,0,{"$f":"Debts!O185","v":false},{"$f":"IF(P343=TRUE,CONCATENATE(Debts!$B$107,\"/\",Debts!B185,\"/\",Debts!N185),\"\")","v":""},null,{"$f":"IF(P343=TRUE,CONCATENATE(Debts!B185,\" - \",Debts!N185),\"\")","v":""}]
[null,{"$f":"Debts!A186","v":264},{"$f":"Debts!B186","v":0},null,{"$f":"Debts!D186","v":0},{"$f":"Debts!F186","v":""},{"$f":"Debts!H186","v":"M"},"",{"$f":"Debts!L186","v":false},{"$f":"Debts!K186","v":false},0,0,0,0,0,{"$f":"Debts!O186","v":false},{"$f":"IF(P344=TRUE,CONCATENATE(Debts!$B$107,\"/\",Debts!B186,\"/\",Debts!N186),\"\")","v":""},null,{"$f":"IF(P344=TRUE,CONCATENATE(Debts!B186,\" - \",Debts!N186),\"\")","v":""}]
[null,{"$f":"Debts!A187","v":265},{"$f":"Debts!B187","v":0},null,{"$f":"Debts!D187","v":0},{"$f":"Debts!F187","v":""},{"$f":"Debts!H187","v":"M"},"",{"$f":"Debts!L187","v":false},{"$f":"Debts!K187","v":false},0,0,0,0,0,{"$f":"Debts!O187","v":false},{"$f":"IF(P345=TRUE,CONCATENATE(Debts!$B$107,\"/\",Debts!B187,\"/\",Debts!N187),\"\")","v":""},null,{"$f":"IF(P345=TRUE,CONCATENATE(Debts!B187,\" - \",Debts!N187),\"\")","v":""}]
[null,{"$f":"Debts!A188","v":266},{"$f":"Debts!B188","v":0},null,{"$f":"Debts!D188","v":0},{"$f":"Debts!F188","v":""},{"$f":"Debts!H188","v":"M"},"",{"$f":"Debts!L188","v":false},{"$f":"Debts!K188","v":false},0,0,0,0,0,{"$f":"Debts!O188","v":false},{"$f":"IF(P346=TRUE,CONCATENATE(Debts!$B$107,\"/\",Debts!B188,\"/\",Debts!N188),\"\")","v":""},null,{"$f":"IF(P346=TRUE,CONCATENATE(Debts!B188,\" - \",Debts!N188),\"\")","v":""}]
[null,{"$f":"Debts!A189","v":267},{"$f":"Debts!B189","v":0},null,{"$f":"Debts!D189","v":0},{"$f":"Debts!F189","v":""},{"$f":"Debts!H189","v":"M"},"",{"$f":"Debts!L189","v":false},{"$f":"Debts!K189","v":false},0,0,0,0,0,{"$f":"Debts!O189","v":false},{"$f":"IF(P347=TRUE,CONCATENATE(Debts!$B$107,\"/\",Debts!B189,\"/\",Debts!N189),\"\")","v":""},null,{"$f":"IF(P347=TRUE,CONCATENATE(Debts!B189,\" - \",Debts!N189),\"\")","v":""}]
[null,{"$f":"Debts!A190","v":268},{"$f":"Debts!B190","v":0},null,{"$f":"Debts!D190","v":0},{"$f":"Debts!F190","v":""},{"$f":"Debts!H190","v":"M"},"",{"$f":"Debts!L190","v":false},{"$f":"Debts!K190","v":false},0,0,0,0,0,{"$f":"Debts!O190","v":false},{"$f":"IF(P348=TRUE,CONCATENATE(Debts!$B$107,\"/\",Debts!B190,\"/\",Debts!N190),\"\")","v":""},null,{"$f":"IF(P348=TRUE,CONCATENATE(Debts!B190,\" - \",Debts!N190),\"\")","v":""}]
[null,{"$f":"Debts!A191","v":269},{"$f":"Debts!B191","v":0},null,{"$f":"Debts!D191","v":0},{"$f":"Debts!F191","v":""},{"$f":"Debts!H191","v":"M"},"",{"$f":"Debts!L191","v":false},{"$f":"Debts!K191","v":false},0,0,0,0,0,{"$f":"Debts!O191","v":false},{"$f":"IF(P349=TRUE,CONCATENATE(Debts!$B$107,\"/\",Debts!B191,\"/\",Debts!N191),\"\")","v":""},null,{"$f":"IF(P349=TRUE,CONCATENATE(Debts!B191,\" - \",Debts!N191),\"\")","v":""}]
[null,{"$f":"Debts!A192","v":270},{"$f":"Debts!B192","v":0},null,{"$f":"Debts!D192","v":0},{"$f":"Debts!F192","v":""},{"$f":"Debts!H192","v":"M"},"",{"$f":"Debts!L192","v":false},{"$f":"Debts!K192","v":false},0,0,0,0,0,{"$f":"Debts!O192","v":false},{"$f":"IF(P350=TRUE,CONCATENATE(Debts!$B$107,\"/\",Debts!B192,\"/\",Debts!N192),\"\")","v":""},null,{"$f":"IF(P350=TRUE,CONCATENATE(Debts!B192,\" - \",Debts!N192),\"\")","v":""}]
[null,{"$f":"Debts!A193","v":271},{"$f":"Debts!B193","v":0},null,{"$f":"Debts!D193","v":0},{"$f":"Debts!F193","v":""},{"$f":"Debts!H193","v":"M"},"",{"$f":"Debts!L193","v":false},{"$f":"Debts!K193","v":false},0,0,0,0,0,{"$f":"Debts!O193","v":false},{"$f":"IF(P351=TRUE,CONCATENATE(Debts!$B$107,\"/\",Debts!B193,\"/\",Debts!N193),\"\")","v":""},null,{"$f":"IF(P351=TRUE,CONCATENATE(Debts!B193,\" - \",Debts!N193),\"\")","v":""}]
[null,{"$f":"Debts!A194","v":272},{"$f":"Debts!B194","v":0},null,{"$f":"Debts!D194","v":0},{"$f":"Debts!F194","v":""},{"$f":"Debts!H194","v":"M"},"",{"$f":"Debts!L194","v":false},{"$f":"Debts!K194","v":false},0,0,0,0,0,{"$f":"Debts!O194","v":false},{"$f":"IF(P352=TRUE,CONCATENATE(Debts!$B$107,\"/\",Debts!B194,\"/\",Debts!N194),\"\")","v":""},null,{"$f":"IF(P352=TRUE,CONCATENATE(Debts!B194,\" - \",Debts!N194),\"\")","v":""}]
[null,{"$f":"Debts!A195","v":273},{"$f":"Debts!B195","v":0},null,{"$f":"Debts!D195","v":0},{"$f":"Debts!F195","v":""},{"$f":"Debts!H195","v":"M"},"",{"$f":"Debts!L195","v":false},{"$f":"Debts!K195","v":false},0,0,0,0,0,{"$f":"Debts!O195","v":false},{"$f":"IF(P353=TRUE,CONCATENATE(Debts!$B$107,\"/\",Debts!B195,\"/\",Debts!N195),\"\")","v":""},null,{"$f":"IF(P353=TRUE,CONCATENATE(Debts!B195,\" - \",Debts!N195),\"\")","v":""}]
[null,{"$f":"Debts!A196","v":274},{"$f":"Debts!B196","v":0},null,{"$f":"Debts!D196","v":0},{"$f":"Debts!F196","v":""},{"$f":"Debts!H196","v":"M"},"",{"$f":"Debts!L196","v":false},{"$f":"Debts!K196","v":false},0,0,0,0,0,{"$f":"Debts!O196","v":false},{"$f":"IF(P354=TRUE,CONCATENATE(Debts!$B$107,\"/\",Debts!B196,\"/\",Debts!N196),\"\")","v":""},null,{"$f":"IF(P354=TRUE,CONCATENATE(Debts!B196,\" - \",Debts!N196),\"\")","v":""}]
[null,{"$f":"Debts!A197","v":275},{"$f":"Debts!B197","v":0},null,{"$f":"Debts!D197","v":0},{"$f":"Debts!F197","v":""},{"$f":"Debts!H197","v":"M"},"",{"$f":"Debts!L197","v":false},{"$f":"Debts!K197","v":false},0,0,0,0,0,{"$f":"Debts!O197","v":false},{"$f":"IF(P355=TRUE,CONCATENATE(Debts!$B$107,\"/\",Debts!B197,\"/\",Debts!N197),\"\")","v":""},null,{"$f":"IF(P355=TRUE,CONCATENATE(Debts!B197,\" - \",Debts!N197),\"\")","v":""}]
[null,{"$f":"Debts!A198","v":276},{"$f":"Debts!B198","v":0},null,{"$f":"Debts!D198","v":0},{"$f":"Debts!F198","v":""},{"$f":"Debts!H198","v":"M"},"",{"$f":"Debts!L198","v":false},{"$f":"Debts!K198","v":false},0,0,0,0,0,{"$f":"Debts!O198","v":false},{"$f":"IF(P356=TRUE,CONCATENATE(Debts!$B$107,\"/\",Debts!B198,\"/\",Debts!N198),\"\")","v":""},null,{"$f":"IF(P356=TRUE,CONCATENATE(Debts!B198,\" - \",Debts!N198),\"\")","v":""}]
[null,{"$f":"Debts!A199","v":277},{"$f":"Debts!B199","v":0},null,{"$f":"Debts!D199","v":0},{"$f":"Debts!F199","v":""},{"$f":"Debts!H199","v":"M"},"",{"$f":"Debts!L199","v":false},{"$f":"Debts!K199","v":false},0,0,0,0,0,{"$f":"Debts!O199","v":false},{"$f":"IF(P357=TRUE,CONCATENATE(Debts!$B$107,\"/\",Debts!B199,\"/\",Debts!N199),\"\")","v":""},null,{"$f":"IF(P357=TRUE,CONCATENATE(Debts!B199,\" - \",Debts!N199),\"\")","v":""}]
[null,{"$f":"Debts!A200","v":278},{"$f":"Debts!B200","v":0},null,{"$f":"Debts!D200","v":0},{"$f":"Debts!F200","v":""},{"$f":"Debts!H200","v":"M"},"",{"$f":"Debts!L200","v":false},{"$f":"Debts!K200","v":false},0,0,0,0,0,{"$f":"Debts!O200","v":false},{"$f":"IF(P358=TRUE,CONCATENATE(Debts!$B$107,\"/\",Debts!B200,\"/\",Debts!N200),\"\")","v":""},null,{"$f":"IF(P358=TRUE,CONCATENATE(Debts!B200,\" - \",Debts!N200),\"\")","v":""}]
[null,{"$f":"Debts!A201","v":279},{"$f":"Debts!B201","v":0},null,{"$f":"Debts!D201","v":0},{"$f":"Debts!F201","v":""},{"$f":"Debts!H201","v":"M"},"",{"$f":"Debts!L201","v":false},{"$f":"Debts!K201","v":false},0,0,0,0,0,{"$f":"Debts!O201","v":false},{"$f":"IF(P359=TRUE,CONCATENATE(Debts!$B$107,\"/\",Debts!B201,\"/\",Debts!N201),\"\")","v":""},null,{"$f":"IF(P359=TRUE,CONCATENATE(Debts!B201,\" - \",Debts!N201),\"\")","v":""}]
[null,{"$f":"Debts!A202","v":280},{"$f":"Debts!B202","v":0},null,{"$f":"Debts!D202","v":0},{"$f":"Debts!F202","v":""},{"$f":"Debts!H202","v":"M"},"",{"$f":"Debts!L202","v":false},{"$f":"Debts!K202","v":false},0,0,0,0,0,{"$f":"Debts!O202","v":false},{"$f":"IF(P360=TRUE,CONCATENATE(Debts!$B$107,\"/\",Debts!B202,\"/\",Debts!N202),\"\")","v":""},null,{"$f":"IF(P360=TRUE,CONCATENATE(Debts!B202,\" - \",Debts!N202),\"\")","v":""}]
[null,{"$f":"Debts!A203","v":281},{"$f":"Debts!B203","v":0},null,{"$f":"Debts!D203","v":0},{"$f":"Debts!F203","v":""},{"$f":"Debts!H203","v":"M"},"",{"$f":"Debts!L203","v":false},{"$f":"Debts!K203","v":false},0,0,0,0,0,{"$f":"Debts!O203","v":false},{"$f":"IF(P361=TRUE,CONCATENATE(Debts!$B$107,\"/\",Debts!B203,\"/\",Debts!N203),\"\")","v":""},null,{"$f":"IF(P361=TRUE,CONCATENATE(Debts!B203,\" - \",Debts!N203),\"\")","v":""}]
[null,{"$f":"Debts!A204","v":282},{"$f":"Debts!B204","v":0},null,{"$f":"Debts!D204","v":0},{"$f":"Debts!F204","v":""},{"$f":"Debts!H204","v":"M"},"",{"$f":"Debts!L204","v":false},{"$f":"Debts!K204","v":false},0,0,0,0,0,{"$f":"Debts!O204","v":false},{"$f":"IF(P362=TRUE,CONCATENATE(Debts!$B$107,\"/\",Debts!B204,\"/\",Debts!N204),\"\")","v":""},null,{"$f":"IF(P362=TRUE,CONCATENATE(Debts!B204,\" - \",Debts!N204),\"\")","v":""}]
[null,{"$f":"Debts!A205","v":283},{"$f":"Debts!B205","v":0},null,{"$f":"Debts!D205","v":0},{"$f":"Debts!F205","v":""},{"$f":"Debts!H205","v":"M"},"",{"$f":"Debts!L205","v":false},{"$f":"Debts!K205","v":false},0,0,0,0,0,{"$f":"Debts!O205","v":false},{"$f":"IF(P363=TRUE,CONCATENATE(Debts!$B$107,\"/\",Debts!B205,\"/\",Debts!N205),\"\")","v":""},null,{"$f":"IF(P363=TRUE,CONCATENATE(Debts!B205,\" - \",Debts!N205),\"\")","v":""}]
[null,null,null,null,null,null,null,null,null,null,null,null,null,null,null,{"$f":"IF(P267=TRUE,TRUE,FALSE)","v":false},"\"",null,{"$f":"Q364","v":"\""}]
[null,null,"Total Non-priority Debts",null,{"$f":"SUM(E268:E364)","v":0},null,null,{"$f":"SUM(H268:H364)","v":0},{"$f":"COUNTIF(I268:I364,TRUE)","v":0},{"$f":"COUNTIF(J268:J364,TRUE)","v":0},{"$f":"SUM(K268:K364)","v":0},{"$f":"SUM(L268:L364)","v":0},{"$f":"SUM(M268:M364)","v":0},{"$f":"SUM(N268:N364)","v":0},{"$f":"SUM(O268:O364)","v":0}]
[]
[null,"Monthly Total Income from above",null,null,{"$f":"H48","v":0},"E178"]
[null,"Monthly Total Expenditure from above",null,null,{"$f":"H164","v":0},"E179"]
[null,"Potential monthly saving amount",null,null,{"$f":"Savings!D8","v":0},{"$f":"ROUNDDOWN(E371*0.1,1)","v":0}]
[null,"Debt Admin Fee",null,null,{"$f":"'Debt Admin Fee'!$E$8","v":0},{"$f":"'Debt Admin Fee'!$G$8","v":"M"},{"$f":"IF(F370=\"W\",E370*52/12,IF(OR(F370=\"M\",LEN(F370)=0),E370,IF(F370=\"Q\",E370/3,IF(F370=\"F\",E370*26/12,IF(OR(F370=\"A\",F370=\"Y\"),E370/12,E370)))))","v":0}]
[null,"Total Available for Creditors",null,null,{"$f":"E367 - E368-E369-G370","v":0},"E180"]
[null,"Monthly Total Priority Debts from above",null,null,{"$f":"H263","v":0},"E181"]
[null,"Total Available for Non-priority Creditors",null,null,{"$f":"E371-E372","v":0},"E182"]
[null,"Total Owed - Fixed Non-priority payments",null,null,{"$f":"SUMIF($I268:$I364, \"=true\", E268:E364)","v":0},"E183"]
[null,"Total Fixed Non-priority payments",null,null,{"$f":"SUMIF($I268:$I364, \"true\", H268:H364)","v":0},"E184"]
[null,"Total Owed - Pro-rata Non-priority payments",null,null,{"$f":"E365 - E374","v":0},"E185"]
[null,"Total Pro-rata Non-priority payments",null,null,{"$f":"E373 - E375","v":0},"E186"]
[null,"Total Amount Owed for last 10 Creditors",null,null,{"$f":"SUM(E295:E304)","v":0},"E187"]
[null,"Minimum Payment (round up)",null,null,0,"E188"]
[null,"Token Payments",null,null,{"$f":"Debts!$O$209","v":0},"E189"]
[null,"Round to nearest",null,null,{"$f":"Debts!$O$211","v":0},"E190"]
[null,"Years to repay Non-priority Debts",null,null,{"$f":"IF(E377 > 0, ( E376 / E377 ) / 12, 0 )","v":0},"E191"]
[]
[null,"Total Available for Non-priority Creditors",null,null,{"$f":"E371-E372","v":0}]
[null,"Total Available for Non-priority Creditors",null,null,{"$f":"E371-E372","v":0}]

{"sheet":"Spending Guidelines","index":13,"n_rows":14,"n_cols":16,"rows_kept":14,"cut":false,"hidden":false,"merged":[[9,7,9,8],[9,9,9,10],[9,11,9,12],[9,13,9,14],[1,1,1,5],[8,1,8,6]]}
[]
[null,"Categories Trigger Figure"]
[null,null,"First Adult","Additional Adults","Children Under 16","Children 16 -18"]
[null,null,"Amount","Per Head","Per Head","Per Head"]
[null,"COMMS & LEISURE",186,87,24,59]
[null,"HOUSEKEEP",311,178,118,159]
[null,"PERSONAL",58,49,39,73]
[]
[null,"Spending Guidelines"]
[null,null,"First Adult","Additional Adults","Children Under 16","Children 16 -18","Own Vehicle","Additional Adults",null,"Children Under 16",null,"Children 16 -18",null,"Own Vehicle"]
[null,null,"Amount","Per Head","Per Head","Per Head","Per Vehicle","Number","Amount","Number","Amount","Number","Amount","Number","Amount","Amount"]
[null,"COMMS & LEISURE",198,133,56,105,null,{"$f":"Start!$C$27 - Start!$D$23 - Start!$F$23 - 1","v":-1},{"$f":"D12*H12","v":-133},{"$f":"Start!$D$23","v":0},{"$f":"E12*J12","v":0},{"$f":"Start!$F$23","v":0},{"$f":"F12*L12","v":0},null,null,{"$f":"ROUND( C12 + I12 + K12 + M12 + O12, 0 )","v":65}]
[null,"HOUSEKEEP",327,218,118,198,null,{"$f":"Start!$C$27 - Start!$D$23 - Start!$F$23 - 1","v":-1},{"$f":"D13*H13","v":-218},{"$f":"Start!$D$23","v":0},{"$f":"E13*J13","v":0},{"$f":"Start!$F$23","v":0},{"$f":"F13*L13","v":0},null,null,{"$f":"ROUND( C13 + I13 + K13 + M13 + O13, 0 )","v":109}]
[null,"PERSONAL",88,58,28,77,null,{"$f":"Start!$C$27 - Start!$D$23 - Start!$F$23 - 1","v":-1},{"$f":"D14*H14","v":-58},{"$f":"Start!$D$23","v":0},{"$f":"E14*J14","v":0},{"$f":"Start!$F$23","v":0},{"$f":"F14*L14","v":0},null,null,{"$f":"ROUND( C14 + I14 + K14 + M14 + O14, 0 )","v":30}]

{"sheet":"Lookup","index":14,"n_rows":6,"n_cols":3,"rows_kept":6,"cut":false,"hidden":true,"merged":[]}
[]
[null,"W","W"]
[null,"M","F"]
[null,"Q","M"]
[null,"A","Q"]
[null,null,"A"]